program: Gaussian 09
title: 000036107
version: EM64L-G09RevD.01
frameworkgroup: C1[X(C16H22Cl2O4)]
method: RPBEPBE
basis: SDD
operation: Freq
keyword: #p
keyword: freq=noraman
keyword: PBEPBE/SDD
title: #p freq=noraman PBEPBE/SDD
converged: YES YES NO NO
title: Mulliken charges:
elementType: Cl Cl O O O O C C C C C C C C C C C C C C C C H H H H H H H H H H H H H H H H H H H H H H
charge: -0.020573 -0.052827 -0.269537 -0.237525 -0.246606 -0.246935 -0.375519 -0.260717 -0.345735 -0.416496 -0.500160 -0.294358 -0.255460 -0.313786 -0.691821 0.245658 0.505670 -0.310803 -0.323125 -0.195855 -0.229637 -0.117619 0.206243 0.224023 0.190220 0.183265 0.203082 0.188436 0.259665 0.230541 0.245080 0.230133 0.241967 0.211453 0.198897 0.223574 0.240276 0.223131 0.208258 0.224592 0.213955 0.266668 0.281938 0.258368
chargesum: 0.00000
title: Mulliken charges with hydrogens summed into heavy atoms:
elementType: Cl Cl O O O O C C C C C C C C C C C C C C C C
charge: -0.020573 -0.052827 -0.269537 -0.237525 -0.246606 -0.246935 0.054746 0.112769 0.045783 0.073710 -0.024947 0.159062 0.167011 0.149620 -0.045016 0.245658 0.505670 -0.310803 -0.056457 0.086083 0.028731 -0.117619
polarizability: 2.50026858e+02 2.01213020e+01 1.59686533e+02 -6.60398322e+00 -8.62390708e+00 1.98046279e+02
1716.lowfreq: -7.7758 -4.6373 0.0013 0.0014 0.0014 5.8268 14.4499 19.6012 21.7803
frequency: 14.2740 19.5722 21.7752 39.2812 42.3072 53.0506 62.1143 68.2293 79.3429 95.1213 113.6827 124.7225 132.7649 140.1785 163.5275 170.3119 177.1545 183.4042 209.4871 237.9946 241.7971 262.1427 272.9373 304.7953 330.7635 364.6182 367.8147 379.7391 412.5893 433.3050 439.9934 450.5377 518.1667 533.6591 547.2216 609.9982 634.8573 670.9194 699.4923 703.3490 743.9048 750.5298 795.7368 807.4565 811.0722 821.8546 829.1552 862.4347 873.7049 894.5123 904.7718 925.6148 937.9788 975.6926 983.2464 990.7272 1011.3589 1030.5509 1040.0876 1052.5582 1080.9843 1083.0504 1084.1615 1095.8814 1103.2937 1126.6158 1146.9839 1149.9253 1162.4077 1204.4016 1208.2602 1213.4539 1225.6557 1236.3151 1253.2777 1261.9165 1274.4069 1276.4612 1286.2649 1289.1156 1317.6312 1328.1139 1339.1611 1355.2046 1356.8197 1368.3048 1383.8843 1391.5464 1395.5196 1401.9674 1436.4105 1452.1442 1457.7506 1465.7686 1467.8241 1472.6654 1477.1995 1477.7731 1479.1786 1486.3764 1494.8161 1567.1838 1595.3565 1633.6849 2905.0557 2922.9075 2954.5378 2957.0182 2965.5200 2975.1855 2983.9932 2993.2094 3009.9653 3017.4315 3022.2409 3027.9221 3034.3718 3055.7532 3072.8331 3074.8888 3085.4138 3102.3823 3124.0571 3159.7659 3178.4399 3181.3238
redmass: 4.8390 7.0580 6.9753 4.7074 6.3365 6.9301 5.3599 1.7588 4.9143 4.5934 2.2914 2.5199 3.8360 3.4279 4.8246 4.8495 4.2240 4.1952 3.8400 1.1352 4.8676 3.2968 5.0551 2.6435 7.6822 3.5943 4.8786 5.7148 4.5698 3.4086 3.2687 4.2516 2.9768 4.9698 4.0895 3.7124 7.6815 2.8589 4.0954 5.6429 1.0749 4.2138 1.5233 3.4903 1.1708 1.6543 3.1571 1.3825 2.5610 1.8970 1.7707 1.3418 1.1607 4.9663 3.3805 2.2767 3.4562 3.9389 3.1368 2.5012 2.5659 3.1363 2.5834 2.5545 2.1413 2.4560 1.3185 1.4908 1.7873 1.2421 1.2602 1.2492 2.0381 2.6769 1.5209 1.1593 1.1855 1.2445 1.0831 1.1837 1.2476 1.3399 1.2953 1.5205 4.3407 1.3098 2.2815 1.2288 2.2253 1.4656 1.1014 1.1575 1.5664 1.2118 1.0845 1.0670 1.0587 1.2471 1.0558 1.0694 1.0911 7.7470 7.5752 9.4360 1.0552 1.0600 1.1048 1.0554 1.0591 1.0361 1.0995 1.0595 1.0998 1.0746 1.0862 1.0652 1.0615 1.1037 1.1008 1.0998 1.1037 1.1031 1.1046 1.0879 1.0960 1.0943
irintensity: 0.0317 0.0915 1.4246 0.1250 1.2309 3.3278 1.5235 1.9394 0.1176 2.0879 9.3106 0.3718 0.5314 2.7258 4.7182 0.0658 3.0382 3.0786 1.6516 0.0828 0.4976 3.0466 5.4160 7.0086 0.5978 2.0038 1.6114 0.6531 4.0816 1.2674 5.7652 6.6938 8.1656 0.6281 7.7739 10.4869 20.7844 8.0021 10.0827 42.2475 11.5980 12.0385 55.8670 10.6583 1.1196 3.9358 9.0495 24.3703 8.0395 11.3713 7.8024 0.0383 0.2487 31.8283 32.8737 33.1021 47.9848 87.4103 8.5505 103.8760 44.7493 80.7980 11.8320 2.5114 3.1782 2.0941 3.8906 1.0112 50.5636 6.0712 9.9612 14.3294 126.4834 127.9900 92.3602 7.7129 0.4544 0.6394 0.0252 3.1472 0.4957 9.7678 13.9141 13.4369 22.6688 2.6201 22.3379 11.2666 8.0590 2.8282 18.8939 76.7228 118.2031 45.3266 24.8630 0.3542 9.6217 19.6398 8.3445 2.8783 17.6586 21.1451 8.7537 160.0698 40.1891 72.2802 69.6692 27.0906 31.7018 28.4979 34.8441 28.8406 7.9969 16.4675 18.1443 34.2614 41.5877 28.0852 95.3024 46.7949 4.2754 26.8663 9.6200 4.8944 1.3819 1.7193
temp: 298.150 k
press: 1.00000 atm
elementType: 17 17 8 8 8 8 6 6 6 6 6 6 6 6 6 6 6 6 6 6 6 6 1 1 1 1 1 1 1 1 1 1 1 1 1 1 1 1 1 1 1 1 1 1
symmnumber: 1
zpe: 924350.2 jmol-1
zpe.correction: 0.352066 hartree
zpe.thermalcorrener: 0.376723 hartree
zpe.thermalcorrenthalpy: 0.377667 hartree
zpe.thermalcorrgfe: 0.293080 hartree
zpe.sumelectzpe: -1842.189390 hartree
zpe.sumelectthermal: -1842.164734 hartree
zpe.sumelectthermalent: -1842.163790 hartree
zpe.sumelectthermalfe: -1842.248376 hartree
dipole: -2.2344 0.9479 -1.2647
dipole: 2.7369
quadrupole: -150.7007 -137.0392 -151.1398
quadrupole: -0.3329 -1.6626 -3.2709
quadrupole: -4.4075 9.2541 -4.8466 -0.3329 -1.6626 -3.2709
hfenergy: -1842.5414566 hartree
pointgroup: C01 [X(C16H22Cl2O4)]
dipole: -0.832002 0.3838532 -0.5655829 debye
polarizability: 253.391214|5.801327|154.624673|-9.9905407|0.6485395|199.7437825 unknown
InChI: InChI=1S/C16H22Cl2O4/c1-2-3-8-20-10-11-22-16(19)5-4-9-21-15-7-6-13(17)12-14(15)18/h6-7,12H,2-5,8-11H2,1H3
charge 0 multiplicity 1
44 atoms
Cl 2.374571 -1.050671 2.951548
Cl 5.368751 -1.153428 -1.724586
O  -1.6085 2.287003 -0.151105
O  -3.950904 0.69137 0.373087
O  0.062426 -1.439758 1.138558
O  -4.133354 -0.675933 -1.508873
C  0.715475 2.611217 0.464566
C  -0.260752 2.489121 -0.708328
C  2.182397 2.757758 -0.002126
C  -2.334293 -1.528359 1.412192
C  -3.725161 -1.662045 0.73091
C  -1.203253 -1.5299 0.381605
C  -2.633538 2.138186 -1.182466
C  -3.973319 1.906991 -0.485978
C  3.161466 2.920403 1.180327
C  -3.971192 -0.544426 -0.272032
C  1.246139 -1.376963 0.410833
C  2.450091 -1.203672 1.146834
C  1.333884 -1.474827 -1.002826
C  3.702041 -1.13512 0.513085
C  2.583989 -1.408307 -1.657876
C  3.749978 -1.240257 -0.892021
H  0.425649 3.483473 1.081904
H  0.613092 1.716257 1.107976
H  -0.246297 3.408886 -1.336482
H  0.012484 1.62611 -1.359006
H  2.470205 1.867603 -0.597735
H  2.272299 3.632293 -0.679251
H  -2.293827 -0.589393 1.989226
H  -2.190209 -2.369136 2.114309
H  -4.504599 -1.62183 1.512783
H  -3.819399 -2.621537 0.194164
H  -1.280867 -0.65281 -0.29173
H  -1.209471 -2.459446 -0.224595
H  -2.715439 3.06421 -1.797265
H  -2.393535 1.295316 -1.864836
H  -4.188656 2.718279 0.225732
H  -4.778931 1.812644 -1.236331
H  2.92342 3.824801 1.771397
H  3.105697 2.050543 1.861178
H  4.205306 3.01041 0.827957
H  0.430796 -1.612867 -1.602973
H  4.612275 -0.999573 1.1022
H  2.640864 -1.489614 -2.74675
