program: Gaussian 09
title: 000035996
version: EM64L-G09RevD.01
frameworkgroup: C1[X(C13H23N)]
method: RPBEPBE
basis: SDD
operation: Freq
keyword: #pfreq=noraman
keyword: PBEPBE/SDD
title: #p freq=noraman PBEPBE/SDD
converged: NO YES NO NO
title: Mulliken charges:
elementType: N C C C C C C C C C C C C C H H H H H H H H H H H H H H H H H H H H H H H
charge: -0.291443 0.478540 -0.099166 -0.109956 -0.103578 -0.532709 -0.543416 -0.540848 -0.450692 -0.451083 -0.450648 -0.494409 -0.407017 -0.629919 0.192430 0.193617 0.193083 0.199663 0.196922 0.204231 0.200896 0.193293 0.199148 0.192392 0.194432 0.194801 0.191295 0.194300 0.191271 0.178434 0.223042 0.223461 0.189859 0.248190 0.186785 0.220101 0.224697
chargesum: 0.00000
title: Mulliken charges with hydrogens summed into heavy atoms:
elementType: N C C C C C C C C C C C C C
charge: -0.043253 0.478540 0.093264 0.083661 0.089505 -0.136124 -0.138289 -0.148407 -0.063868 -0.064987 -0.065077 -0.092933 0.006303 0.001664
polarizability: 1.59872808e+02 -3.67290523e-01 1.25753369e+02 -5.22252132e-01 -8.27477918e-01 1.22482109e+02
1716.lowfreq: -28.7096 -0.0008 -0.0006 0.0004 5.8215 8.0897 44.3331 60.2383 93.4709
frequency: 44.0609 60.2146 93.4012 131.5599 216.3825 230.9032 246.5739 259.0525 301.5956 324.2947 351.1430 390.2832 394.2143 417.3240 428.0076 429.1247 452.6253 591.0040 637.8946 640.4444 661.9964 705.3537 767.1779 773.7078 806.6781 809.5183 866.4468 868.8670 874.1158 910.7170 921.5810 935.3623 959.0684 960.2257 973.5661 983.8617 1016.0751 1043.0403 1046.2778 1048.3520 1060.6019 1095.8286 1096.9983 1101.9078 1104.3054 1111.1409 1113.5038 1131.9619 1141.2755 1158.9427 1181.9659 1189.9725 1214.7557 1250.7334 1262.2716 1280.3424 1284.1384 1290.7478 1303.1132 1307.0182 1307.8080 1310.3022 1311.6673 1324.3755 1342.0862 1343.3526 1352.2989 1356.2837 1362.3616 1373.3909 1435.9193 1447.1060 1448.2426 1451.5540 1455.7722 1461.9606 1463.0268 1464.8961 1466.7146 1481.9077 1487.5939 1498.0389 2845.2827 2864.7330 2937.9193 2949.3401 2952.0570 2957.2380 2959.3201 2959.7169 2960.1587 2987.6650 2988.5524 2995.6069 3001.3431 3005.5430 3009.1668 3011.5932 3012.9884 3018.3466 3021.6684 3021.8271 3024.4744 3071.6004 3440.7068
redmass: 1.6825 3.1122 3.0358 2.5525 2.2780 1.4012 2.0531 3.1982 1.9689 2.2786 2.0614 4.3035 4.6362 1.9407 1.7100 1.7379 2.3952 3.3864 3.8010 3.8304 1.3404 3.7700 3.0983 1.4436 2.5888 2.2807 1.5902 1.5905 1.5587 3.1850 1.9467 2.3225 2.0288 2.0735 2.1321 2.4341 1.6883 2.3794 1.9750 1.7428 1.7776 1.3397 1.5521 1.0457 1.2943 1.0132 1.2201 1.4971 3.2870 3.4047 1.2532 1.1726 1.3615 1.5386 1.4618 1.6453 1.8226 1.8674 2.1653 1.5727 1.7076 1.6136 1.3958 1.3169 1.4345 1.4476 1.4688 1.5614 1.6049 1.4569 1.1481 1.1277 1.1412 1.0904 1.0830 1.0857 1.0927 1.0809 1.0801 1.0892 1.0645 1.0656 1.0703 1.0575 1.0635 1.0598 1.0602 1.0656 1.0600 1.0610 1.0606 1.0835 1.0834 1.0862 1.0832 1.1024 1.0742 1.1018 1.1021 1.0995 1.1011 1.0992 1.1021 1.0993 1.0745
irintensity: 2.3979 0.6505 0.2009 1.9499 1.4071 0.7975 0.7170 1.2398 0.0017 1.7642 0.1736 0.4827 0.0137 1.5360 0.0792 0.1391 6.7275 5.6592 0.0239 0.0602 108.2698 1.4988 0.7406 0.3018 2.2799 3.2879 0.0819 0.0305 0.0792 0.0473 0.4598 0.0361 7.3981 3.4953 6.7416 1.0436 5.2515 1.2017 2.6759 0.1105 0.8214 8.7268 1.5798 0.7227 3.4132 0.0207 1.4112 17.4832 0.7030 36.1444 1.0238 0.8982 0.6183 0.2828 1.7928 0.6465 0.5615 0.2075 4.9269 3.7815 1.2811 1.8950 1.9273 0.0213 1.7682 2.1595 3.9251 0.5188 0.0578 2.6559 1.9243 4.8265 9.3040 1.3115 2.3257 20.1326 18.3697 24.1806 2.3719 1.4087 11.7630 6.2877 82.5012 171.4897 22.6326 26.3806 29.5540 4.8973 76.3647 52.1374 20.0026 161.9232 163.1804 18.7776 48.0520 3.9734 53.1966 3.7089 4.7229 6.2278 106.3558 109.8365 106.6525 42.5304 1.7370
temp: 298.150 k
press: 1.00000 atm
elementType: 7 6 6 6 6 6 6 6 6 6 6 6 6 6 1 1 1 1 1 1 1 1 1 1 1 1 1 1 1 1 1 1 1 1 1 1 1
symmnumber: 1
zpe: 886415.7 jmol-1
zpe.correction: 0.337618 hartree
zpe.thermalcorrener: 0.350646 hartree
zpe.thermalcorrenthalpy: 0.351590 hartree
zpe.thermalcorrgfe: 0.298527 hartree
zpe.sumelectzpe: -562.809018 hartree
zpe.sumelectthermal: -562.795990 hartree
zpe.sumelectthermalent: -562.795046 hartree
zpe.sumelectthermalfe: -562.848109 hartree
dipole: 0.2091 0.3986 0.9577
dipole: 1.0582
quadrupole: -87.6022 -88.1059 -88.1115
quadrupole: -1.7771 -4.4279 -2.0320
quadrupole: 0.3377 -0.1661 -0.1716 -1.7771 -4.4279 -2.0320
hfenergy: -563.1466362 hartree
pointgroup: C01 [X(C13H23N1)]
dipole: -0.0822018 0.2116989 -0.3489433 debye
polarizability: 159.8735359|0.3667109|125.4328148|-0.499315|1.2757167|122.8019359 unknown
InChI: InChI=1S/C13H23N/c1-14-3-2-13-7-10-4-11(8-13)6-12(5-10)9-13/h10-12,14H,2-9H2,1H3
charge 0 multiplicity 1
37 atoms
N  4.05118 -0.421039 -0.060706
C  0.14447 -0.375197 -0.033379
C  -2.293194 -1.178683 0.043619
C  -1.633762 0.956406 1.240173
C  -1.693202 0.887669 -1.295357
C  -0.804203 -1.613432 0.021348
C  -0.145115 0.514394 1.214169
C  -0.204925 0.442395 -1.315201
C  -2.549753 -0.294921 1.295142
C  -2.610243 -0.363519 -1.239131
C  -1.949652 1.771558 -0.043757
C  1.61447 -0.878247 -0.051651
C  2.713366 0.200134 0.044557
C  5.17571 0.525969 0.042513
H  -2.939496 -2.078342 0.083031
H  -1.813041 1.587189 2.133857
H  -1.913901 1.470014 -2.212403
H  -0.572506 -2.214406 0.924926
H  -0.611599 -2.263072 -0.857861
H  0.501759 1.414399 1.199092
H  0.102811 -0.049376 2.137455
H  -0.008401 -0.179581 -2.213592
H  0.44796 1.335113 -1.388731
H  -2.345003 -0.875254 2.217673
H  -3.61424 0.013478 1.33189
H  -3.675284 -0.05494 -1.241595
H  -2.449399 -0.992134 -2.138479
H  -3.005381 2.110267 -0.028092
H  -1.31477 2.680119 -0.082298
H  1.769153 -1.459958 -0.987946
H  1.769763 -1.588583 0.785413
H  2.659718 0.705653 1.028403
H  2.549731 0.991869 -0.73099
H  4.121118 -1.015582 -0.897873
H  5.148373 1.36056 -0.702407
H  6.131958 -0.013254 -0.080581
H  5.18003 0.984333 1.049471
