program: Gaussian 09
title: 000035994
version: EM64L-G09RevD.01
frameworkgroup: C1[X(C14H25N)]
method: RPBEPBE
basis: SDD
operation: Freq
keyword: #pfreq=noraman
keyword: PBEPBE/SDD
title: #p freq=noraman PBEPBE/SDD
converged: YES YES NO NO
title: Mulliken charges:
elementType: N C C C C C C C C C C C C C C H H H H H H H H H H H H H H H H H H H H H H H H H
charge: -0.075779 0.475571 -0.099066 -0.110266 -0.105202 -0.536966 -0.545807 -0.534593 -0.450346 -0.452119 -0.449951 -0.504503 -0.392356 -0.629732 -0.617754 0.192129 0.193002 0.193520 0.197449 0.199824 0.209372 0.197211 0.199631 0.192028 0.191376 0.194629 0.194457 0.192700 0.194113 0.191225 0.211954 0.206817 0.189284 0.220486 0.217190 0.182092 0.240939 0.183187 0.219976 0.224279
chargesum: 0.00000
title: Mulliken charges with hydrogens summed into heavy atoms:
elementType: N C C C C C C C C C C C C C C
charge: -0.075779 0.475571 0.093064 0.082736 0.088317 -0.139693 -0.139224 -0.142934 -0.064341 -0.064962 -0.064612 -0.085732 0.017414 0.010488 0.009688
polarizability: 1.72585835e+02 1.88703499e-01 1.37021128e+02 1.59118802e-01 -9.50323573e-02 1.30947177e+02
1716.lowfreq: -14.0054 -5.2572 -0.0006 0.0003 0.0003 5.0639 25.2916 57.0251 81.4743
frequency: 22.1986 56.8284 81.4500 131.8560 203.4165 221.5431 232.2359 246.7694 253.3151 296.3923 325.4256 341.2566 356.9998 392.8718 396.5809 418.1970 421.4954 429.8682 451.7009 461.8025 596.0058 638.9682 641.1026 705.3553 766.2510 773.4534 801.5364 809.3724 823.6703 867.5494 870.0486 874.1188 912.2432 924.5624 941.4109 961.4648 967.4553 984.5969 1017.5541 1022.5433 1032.1757 1047.3098 1048.9029 1063.1119 1066.6406 1090.9295 1100.1308 1104.0593 1104.8164 1105.4822 1111.0693 1130.6188 1140.2474 1161.4630 1181.3314 1194.4330 1218.5216 1252.1424 1262.4427 1274.8235 1285.4201 1288.2421 1294.0410 1304.1787 1307.2867 1313.3196 1315.4059 1319.5364 1324.3967 1342.7175 1343.5471 1355.0179 1357.8961 1363.7375 1377.9532 1416.7768 1439.5949 1447.6659 1451.6502 1454.7542 1460.3642 1462.8973 1463.9642 1464.9043 1469.8744 1476.4976 1477.7295 1484.5825 1486.8933 2828.0333 2833.7776 2853.3246 2948.6935 2953.2017 2956.7050 2958.5657 2960.4164 2961.1610 2961.5368 2988.7173 2989.2147 3002.1484 3004.4552 3006.3546 3012.2363 3014.1951 3014.7689 3019.9872 3022.9521 3024.9818 3028.0239 3028.4361 3074.1046 3087.0521
redmass: 2.6074 3.0015 3.1538 2.1950 2.8338 1.9585 1.5248 1.3561 1.4370 1.9593 2.2547 2.1929 2.1247 4.6057 4.6739 1.9215 1.8616 1.7101 2.0281 2.4508 3.3358 3.8293 3.8247 3.9338 1.9138 2.1570 3.0590 2.3720 3.2935 1.5716 1.5858 1.5744 2.8840 2.0488 2.2946 2.0883 2.2029 2.5421 2.2355 1.7560 1.6242 1.7958 1.7609 1.6883 2.5918 1.3564 1.5530 1.2806 1.2414 1.1136 1.0183 1.3390 3.1893 1.5510 1.2958 1.2069 1.3894 1.7650 2.3238 1.7264 1.8379 1.7705 1.6504 2.2049 1.6917 1.6897 1.5198 1.2608 1.3095 1.4347 1.4304 1.4697 1.5541 1.5992 1.4109 1.1446 1.1678 1.0826 1.0827 1.0739 1.0521 1.0887 1.0886 1.0915 1.0666 1.0526 1.0822 1.0819 1.0680 1.0689 1.0580 1.0591 1.0597 1.0606 1.0601 1.0645 1.0607 1.0609 1.0596 1.0833 1.0834 1.0831 1.0968 1.0969 1.1015 1.1012 1.0714 1.1015 1.1011 1.1020 1.0901 1.0787 1.1010 1.1000
irintensity: 0.4289 0.2739 0.1318 0.6952 0.8691 0.1487 0.3157 0.2045 1.1551 0.0014 6.7373 1.4901 1.2826 0.0252 0.0016 0.2892 0.0467 0.0816 1.9462 1.5452 2.5183 0.0646 0.0208 0.3364 1.1396 0.3775 1.5547 2.4976 17.5443 0.1078 0.0232 0.0916 0.2821 0.3607 0.7424 3.6052 3.8939 8.1978 23.7729 4.4060 18.2493 2.3854 0.2273 1.0472 14.1855 7.0265 7.3149 4.3140 1.4700 0.7812 0.1908 6.2667 0.4261 7.8538 2.1523 3.8453 3.6072 1.6332 4.2495 1.0148 0.5382 1.2696 1.9156 7.3305 6.3001 2.0814 5.3543 0.2536 0.0571 2.2250 2.1032 3.8425 0.3551 0.1870 3.9065 2.8529 2.4146 0.9872 0.3820 3.8563 20.8262 19.8924 15.7700 17.4376 1.5942 6.7680 10.2016 7.5840 14.8540 62.9329 71.0791 225.9605 14.4096 25.3999 24.6801 3.9527 18.4139 43.1623 95.1269 166.6228 161.4980 51.8872 7.3761 9.3587 2.5758 2.9913 44.5196 27.8890 94.8810 105.1615 79.0059 60.6549 38.2146 43.4105
temp: 298.150 k
press: 1.00000 atm
elementType: 7 6 6 6 6 6 6 6 6 6 6 6 6 6 6 1 1 1 1 1 1 1 1 1 1 1 1 1 1 1 1 1 1 1 1 1 1 1 1 1
symmnumber: 1
zpe: 958304.5 jmol-1
zpe.correction: 0.364999 hartree
zpe.thermalcorrener: 0.379263 hartree
zpe.thermalcorrenthalpy: 0.380208 hartree
zpe.thermalcorrgfe: 0.324103 hartree
zpe.sumelectzpe: -602.024096 hartree
zpe.sumelectthermal: -602.009831 hartree
zpe.sumelectthermalent: -602.008887 hartree
zpe.sumelectthermalfe: -602.064992 hartree
dipole: -0.0852 0.0672 0.8152
dipole: 0.8224
quadrupole: -92.9837 -93.2069 -96.5198
quadrupole: 0.1596 3.0909 -0.2731
quadrupole: 1.2531 1.0299 -2.2830 0.1596 3.0909 -0.2731
hfenergy: -602.3890949 hartree
pointgroup: C01 [X(C14H25N1)]
dipole: -0.0341479 0.0107026 0.3215786 debye
polarizability: 172.5847634|-0.1879884|137.0155034|0.2658579|0.2066348|130.9538744 unknown
InChI: InChI=1S/C14H25N/c1-15(2)4-3-14-8-11-5-12(9-14)7-13(6-11)10-14/h11-13H,3-10H2,1-2H3
charge 0 multiplicity 1
40 atoms
N  3.769005 0.047557 -0.271614
C  -0.13816 -0.283333 -0.130688
C  -2.53641 -1.133308 -0.479275
C  -1.992003 0.307204 1.533793
C  -2.01811 1.32754 -0.789849
C  -1.028596 -1.45979 -0.639777
C  -0.483746 -0.025386 1.367959
C  -0.510738 0.98873 -0.952694
C  -2.849097 -0.881193 1.020495
C  -2.876701 0.139447 -1.301064
C  -2.330712 1.580176 0.710516
C  1.353041 -0.680057 -0.325752
C  2.395814 0.312634 0.231614
C  4.304458 -1.260987 0.155667
C  4.692898 1.147521 0.072975
H  -3.139795 -1.987004 -0.847671
H  -2.211833 0.488622 2.605068
H  -2.254662 2.237633 -1.376792
H  -0.78007 -2.381395 -0.07314
H  -0.795624 -1.662665 -1.705764
H  0.123456 0.815538 1.758761
H  -0.222635 -0.921479 1.96911
H  -0.273586 0.817434 -2.023062
H  0.096974 1.854406 -0.620393
H  -2.629323 -1.792428 1.613241
H  -3.927011 -0.657355 1.15311
H  -3.954854 0.379318 -1.203791
H  -2.675879 -0.038711 -2.376955
H  -3.401693 1.838537 0.836267
H  -1.740291 2.44193 1.083029
H  1.553226 -0.799511 -1.410506
H  1.501665 -1.67576 0.140646
H  2.3709 0.301305 1.353284
H  2.130632 1.33903 -0.086106
H  5.318302 -1.396275 -0.262211
H  4.371972 -1.366226 1.27037
H  3.671105 -2.078046 -0.227753
H  4.841052 1.27761 1.176796
H  5.68241 0.95974 -0.381796
H  4.305317 2.099595 -0.332348
