program: Gaussian 09
title: 000035984
version: EM64L-G09RevD.01
frameworkgroup: C1[X(C17H31N)]
method: RPBEPBE
basis: SDD
operation: Freq
keyword: #pfreq=noraman
keyword: PBEPBE/SDD
title: #p freq=noraman PBEPBE/SDD
converged: NO YES NO NO
title: Mulliken charges:
elementType: N C C C C C C C C C C C C C C C C C H H H H H H H H H H H H H H H H H H H H H H H H H H H H H H H
charge: -0.121869 0.525580 -0.105048 -0.114958 -0.099204 -0.529970 -0.568127 -0.539303 -0.452635 -0.449906 -0.450802 -0.567018 -0.013037 -0.756900 0.038665 -0.671229 -0.728894 -0.734837 0.188328 0.190662 0.189787 0.250526 0.170169 0.194419 0.217062 0.197640 0.191561 0.191049 0.192390 0.189180 0.192838 0.193584 0.188845 0.195516 0.189702 0.234665 0.220161 0.220735 0.215052 0.165799 0.230108 0.231734 0.193001 0.219921 0.203980 0.226534 0.212418 0.221359 0.220771
chargesum: 0.00000
title: Mulliken charges with hydrogens summed into heavy atoms:
elementType: N C C C C C C C C C C C C C C C C C
charge: -0.121869 0.525580 0.083280 0.075704 0.090583 -0.109276 -0.156647 -0.150103 -0.069195 -0.067888 -0.068373 -0.181801 0.221628 -0.100952 0.204465 -0.016386 -0.078459 -0.080290
polarizability: 2.01073625e+02 1.25122024e+00 1.72970664e+02 1.39044119e-01 -8.02713262e-01 1.64352678e+02
1716.lowfreq: -28.0956 -12.5792 -0.0006 0.0004 0.0006 3.8235 21.9399 53.3774 57.1830
frequency: 18.8316 53.0974 56.7797 82.9455 131.1316 160.8469 168.3698 183.2735 196.5563 218.8391 243.5101 247.4136 278.5989 292.6525 302.9689 322.3512 353.6917 388.1320 393.5803 394.9178 399.1736 421.9427 428.0319 434.3604 436.2349 453.2681 514.0562 546.1682 603.5206 639.6848 641.6147 685.9960 706.2323 767.9600 798.6344 805.7549 835.7270 860.3420 869.7793 871.8476 876.2304 882.0920 917.0166 921.3524 938.0505 943.8129 949.3181 957.2543 967.9978 969.8256 981.6847 1000.3084 1038.3726 1046.2251 1047.8802 1053.4833 1083.0156 1085.8035 1095.2245 1102.1880 1105.8322 1108.0619 1111.1835 1114.1033 1131.7087 1141.9102 1158.1398 1174.4851 1183.2084 1193.1534 1219.4222 1226.8581 1254.2843 1274.8686 1285.2067 1290.4953 1298.4125 1302.4751 1307.2527 1310.3185 1320.1071 1324.0726 1326.4054 1331.9608 1338.5662 1343.5386 1348.8426 1354.5925 1359.5808 1361.9433 1370.1826 1376.1435 1381.4659 1393.2206 1425.0650 1449.1834 1451.2350 1456.0954 1459.9270 1461.9837 1462.8367 1465.1826 1470.4196 1472.7129 1477.9279 1478.7567 1484.2722 1485.1848 1493.8754 1504.9483 2820.5080 2873.2931 2942.6822 2947.5487 2948.4344 2954.3993 2956.2565 2957.3852 2959.6222 2973.0649 2981.4613 2984.3450 2985.1606 2985.3394 2992.0903 2998.4011 3002.3222 3014.1700 3015.4494 3022.4296 3023.5667 3037.3818 3040.6447 3043.3354 3068.1866 3071.6730 3075.5071 3083.3613 3083.9128 3088.1733 3097.4447
redmass: 3.2413 3.4021 2.6266 2.9384 2.7969 1.2082 1.8905 1.9934 1.1717 1.5197 1.4360 2.2063 2.3506 1.9658 2.0097 2.1647 1.9556 2.9867 2.2108 4.3226 3.7421 1.9821 1.7407 1.7732 1.8663 2.4125 2.7375 2.2697 3.4084 3.7364 3.8274 2.8178 3.8405 3.5056 2.7062 2.8027 2.4725 1.7895 1.5449 1.5861 1.5541 2.2114 1.5576 1.6153 1.9137 1.8848 1.9658 1.5938 2.0843 2.1408 2.4897 2.3768 1.9764 1.8887 1.7726 2.1498 1.6264 1.6632 1.4933 1.3939 1.1048 1.2879 1.0408 1.4890 2.5870 1.9480 1.9231 1.8988 1.2611 1.2879 2.1886 1.6533 1.6093 1.7177 1.8336 1.8652 1.6285 2.1875 1.7377 1.5686 1.3419 1.3152 1.3317 1.4139 1.4026 1.4283 1.4455 1.4440 1.5764 1.4791 1.2939 1.2173 1.2418 1.2032 1.1517 1.0827 1.0823 1.0771 1.0687 1.0626 1.0840 1.0772 1.0697 1.0535 1.0612 1.0592 1.0516 1.0811 1.0551 1.0501 1.0804 1.0574 1.0599 1.0605 1.0633 1.0658 1.0622 1.0610 1.0612 1.0353 1.0357 1.0830 1.0827 1.0372 1.0983 1.0829 1.1012 1.1018 1.1025 1.0997 1.1017 1.0750 1.0956 1.0865 1.0990 1.0981 1.0988 1.0985 1.0989 1.0983 1.0969
irintensity: 0.0106 0.1775 0.0235 0.2546 0.0601 0.4336 0.3903 0.2095 0.0251 0.4625 1.7027 1.6673 1.7450 0.1346 0.0306 0.4362 0.1404 3.2639 0.7836 0.3224 1.8987 0.1125 0.0482 0.0119 0.1103 0.7310 7.2021 3.0052 0.1699 0.0061 0.1334 9.4886 1.5953 2.2591 2.0885 2.9670 7.3172 0.4905 0.1193 0.1251 0.0897 4.1268 5.1058 3.9733 1.6631 2.7238 1.1260 1.3641 10.2532 7.5026 9.0073 10.1343 1.4754 1.5642 0.4863 4.8130 12.3569 9.3085 1.0709 5.2358 0.6391 3.9169 0.4529 27.5145 3.5016 10.2093 22.0272 5.9338 0.6885 7.4604 20.4291 6.5979 7.2668 0.4613 0.1989 0.2173 1.3245 9.6868 1.5571 0.9812 5.2691 0.1036 8.9619 20.9223 0.3071 2.4232 9.1965 3.5852 0.7834 4.5833 13.9157 23.9960 6.5846 28.4094 6.4628 0.3492 1.5457 7.4748 6.9590 7.5407 10.7376 20.7963 4.3860 8.9621 10.7131 8.7264 5.4694 1.1761 17.4347 10.8670 104.8779 127.6806 4.8139 24.8801 31.4368 39.9503 69.6181 19.6733 28.4763 44.5114 22.9746 159.6721 145.2963 40.2047 15.2768 61.5246 38.0648 16.8383 23.9217 55.5381 108.0946 42.8941 19.1380 12.4940 41.6730 31.2466 15.0714 75.3641 56.8958 43.6013 23.8624
temp: 298.150 k
press: 1.00000 atm
elementType: 7 6 6 6 6 6 6 6 6 6 6 6 6 6 6 6 6 6 1 1 1 1 1 1 1 1 1 1 1 1 1 1 1 1 1 1 1 1 1 1 1 1 1 1 1 1 1 1 1
symmnumber: 1
zpe: 1176617.7 jmol-1
zpe.correction: 0.448150 hartree
zpe.thermalcorrener: 0.466480 hartree
zpe.thermalcorrenthalpy: 0.467424 hartree
zpe.thermalcorrgfe: 0.402805 hartree
zpe.sumelectzpe: -719.692252 hartree
zpe.sumelectthermal: -719.673922 hartree
zpe.sumelectthermalent: -719.672978 hartree
zpe.sumelectthermalfe: -719.737597 hartree
dipole: -0.8768 0.3660 -0.1189
dipole: 0.9575
quadrupole: -112.6847 -114.6717 -113.1388
quadrupole: 0.4613 -0.0230 0.2667
quadrupole: 0.8138 -1.1733 0.3596 0.4613 -0.0230 0.2667
hfenergy: -720.140402 hartree
pointgroup: C01 [X(C17H31N1)]
dipole: 0.344731 -0.1471485 -0.0378407 debye
polarizability: 201.0444527|1.3042465|173.0503603|-0.9432341|-0.1342379|164.3021538 unknown
InChI: InChI=1S/C17H31N/c1-12(2)18(4)13(3)8-17-9-14-5-15(10-17)7-16(6-14)11-17/h12-16H,5-11H2,1-4H3
charge 0 multiplicity 1
49 atoms
N  2.367274 0.043604 0.37799
C  -0.774262 -0.712565 0.131762
C  -2.046786 1.286116 1.108086
C  -2.145483 0.829173 -1.384385
C  -3.342395 -0.708232 0.23577
C  -0.769051 0.409988 1.215963
C  -0.86349 -0.039311 -1.269664
C  -2.060689 -1.575292 0.33901
C  -2.1090 1.940225 -0.299301
C  -3.305932 0.402586 1.319743
C  -3.402578 -0.057005 -1.172451
C  0.457985 -1.658651 0.245091
C  1.833777 -1.184938 -0.303846
C  2.831681 -2.381844 -0.310042
C  3.502306 0.720722 -0.333995
C  2.674648 -0.173328 1.812047
C  3.819492 2.082001 0.33191
C  3.202671 0.955031 -1.832812
H  -2.013086 2.077715 1.883651
H  -2.184206 1.293723 -2.390418
H  -4.23426 -1.348892 0.388649
H  0.140674 1.025336 1.090164
H  -0.720851 -0.054214 2.224268
H  -0.861782 -0.818183 -2.061784
H  0.027288 0.598962 -1.429773
H  -2.016661 -2.071195 1.331433
H  -2.093838 -2.380215 -0.425189
H  -3.009987 2.581621 -0.381697
H  -1.224746 2.5909 -0.453914
H  -3.282995 -0.054233 2.330234
H  -4.223666 1.022628 1.260788
H  -4.32151 0.555917 -1.27108
H  -3.448611 -0.844492 -1.95238
H  0.555756 -1.987565 1.30128
H  0.219956 -2.581452 -0.326965
H  1.658536 -0.895554 -1.354323
H  3.821291 -2.08202 -0.702106
H  2.976384 -2.792026 0.70691
H  2.451145 -3.199659 -0.949803
H  4.43243 0.094573 -0.265325
H  1.883619 -0.78284 2.276776
H  2.697161 0.788966 2.351039
H  3.652757 -0.686107 1.985892
H  2.91079 2.711705 0.358015
H  4.596788 2.611328 -0.248707
H  4.196779 1.972421 1.362817
H  4.002144 1.578628 -2.271975
H  3.160639 0.019952 -2.417764
H  2.242493 1.490292 -1.953087
