program: Gaussian 09
title: 000035860
version: EM64L-G09RevD.01
frameworkgroup: C1[X(C9H16O2)]
method: RPBEPBE
basis: SDD
operation: Freq
keyword: #pfreq=noraman
keyword: PBEPBE/SDD
title: #p freq=noraman PBEPBE/SDD
converged: NO YES NO NO
title: Mulliken charges:
elementType: O O C C C C C C C C C H H H H H H H H H H H H H H H H
charge: -0.417472 -0.231512 -0.367706 -0.372389 -0.379156 -0.374405 -0.456734 -0.487486 -0.034768 0.171899 -0.597172 0.190674 0.193226 0.193431 0.198417 0.217155 0.218808 0.211892 0.194282 0.205770 0.199353 0.251923 0.252748 0.212047 0.214169 0.217560 0.375447
chargesum: 0.00000
title: Mulliken charges with hydrogens summed into heavy atoms:
elementType: O O C C C C C C C C C
charge: -0.042025 -0.231512 0.016194 0.019459 0.027018 0.061558 -0.051611 0.017184 0.177280 0.171899 -0.165443
polarizability: 1.42485279e+02 -2.02472540e+00 8.93231751e+01 8.44146352e+00 2.15768342e+00 8.01152553e+01
1716.lowfreq: -2.4981 -0.0005 -0.0004 0.0004 5.6858 13.6468 25.3567 32.8106 50.1987
frequency: 21.7587 30.4419 49.6003 68.5869 74.9666 99.9943 132.3235 140.3739 153.5612 211.7454 254.1950 372.4806 388.8266 449.9292 490.0849 501.1118 587.6172 636.7671 638.2699 722.2238 736.0328 784.0459 856.6443 862.0335 918.4351 940.2883 956.3089 995.2359 1002.3438 1019.4987 1033.3841 1053.7146 1067.5375 1080.9514 1098.1178 1116.8144 1177.2802 1212.1462 1220.1119 1242.9249 1259.2992 1271.7236 1278.3658 1288.3102 1292.2977 1296.1431 1313.1870 1342.5150 1357.7371 1373.8567 1423.7681 1438.0955 1458.7491 1463.7409 1465.2684 1476.5529 1486.4019 1657.6456 1667.6634 2952.0130 2953.4396 2958.1681 2968.6036 2986.5423 2990.7512 2996.1087 3005.8729 3020.3399 3031.3996 3043.5885 3062.5248 3070.4672 3089.4262 3193.0265 3511.6012
redmass: 3.5488 4.1045 3.6574 2.6502 2.1945 2.5185 2.3739 2.1478 2.6023 5.3190 3.0995 2.8526 3.4014 2.3493 3.1108 1.8053 4.5253 1.3250 1.5522 1.0750 1.1427 1.2785 4.5993 1.3735 1.8590 1.3242 1.4323 4.3266 1.1143 2.3548 2.2694 1.9048 2.7606 2.1822 3.0428 1.4539 1.8791 1.3221 1.3967 1.4246 1.2505 1.3470 1.1223 1.1856 1.1204 1.1214 1.4438 1.5217 1.6467 1.8540 1.1803 1.0849 1.0908 1.0644 1.0877 1.0975 1.1005 4.7816 8.1956 1.0606 1.0608 1.0594 1.0607 1.0614 1.0973 1.0596 1.0979 1.0999 1.0993 1.1030 1.1030 1.0796 1.0739 1.1145 1.0639
irintensity: 0.6274 0.0192 0.2525 0.1861 0.0813 0.1868 0.3298 0.4054 0.7505 0.8846 0.7277 1.2999 8.3567 0.8239 28.1238 29.8625 13.9688 130.5047 12.7171 17.1415 0.9188 5.2391 1.6997 2.5629 1.9367 79.4509 7.5514 71.1908 18.3098 0.7346 144.8001 40.4238 6.7802 7.9292 33.8491 0.5338 7.4946 16.7275 4.4130 0.8735 0.5051 9.0659 4.3549 1.9331 0.2751 0.2688 20.1980 10.0093 4.9489 33.1373 3.7674 27.7316 3.5528 0.2346 3.0211 0.5077 25.1121 21.1656 209.6410 15.6724 3.2880 11.4179 91.4122 5.1039 1.7766 40.6030 7.0725 4.3924 0.3670 64.9753 82.2804 52.3962 7.2073 32.9148 17.9655
temp: 298.150 k
press: 1.00000 atm
elementType: 8 8 6 6 6 6 6 6 6 6 6 1 1 1 1 1 1 1 1 1 1 1 1 1 1 1 1
symmnumber: 1
zpe: 609161.8 jmol-1
zpe.correction: 0.232017 hartree
zpe.thermalcorrener: 0.245638 hartree
zpe.thermalcorrenthalpy: 0.246582 hartree
zpe.thermalcorrgfe: 0.188879 hartree
zpe.sumelectzpe: -502.102630 hartree
zpe.sumelectthermal: -502.089010 hartree
zpe.sumelectthermalent: -502.088066 hartree
zpe.sumelectthermalfe: -502.145769 hartree
dipole: -0.0196 -1.4228 -0.1455
dipole: 1.4304
quadrupole: -68.7650 -74.5374 -66.0960
quadrupole: 4.1451 -0.3992 1.4796
quadrupole: 1.0344 -4.7379 3.7034 4.1451 -0.3992 1.4796
hfenergy: -502.334648 hartree
pointgroup: C01 [X(C9H16O2)]
dipole: -0.0050798 0.5551229 0.0921959 debye
polarizability: 142.3820615|2.3763286|88.9999802|-8.7284053|2.7288473|80.5416681 unknown
InChI: InChI=1S/C9H16O2/c1-2-3-4-5-6-7-8-9(10)11/h2,10H,1,3-8H2
charge 0 multiplicity 1
27 atoms
O  -5.152506 0.830961 -0.029239
O  -4.255532 -1.309079 -0.063543
C  -0.198148 0.49815 0.114171
C  1.038192 -0.427941 0.079708
C  2.374598 0.34146 0.174092
C  -1.530819 -0.276615 0.020881
C  3.612617 -0.59465 0.138173
C  -2.751274 0.662299 0.055844
C  4.918385 0.155498 0.296039
C  -4.075009 -0.072465 -0.018364
C  5.941952 0.152891 -0.594929
H  -0.180265 1.095642 1.049956
H  -0.131684 1.22631 -0.721256
H  0.974512 -1.156891 0.914506
H  1.02338 -1.025275 -0.855505
H  -1.553642 -0.874593 -0.910377
H  -1.603267 -1.004129 0.851822
H  2.447911 1.069453 -0.658487
H  2.392472 0.935377 1.111645
H  3.619937 -1.16738 -0.809745
H  3.511609 -1.336559 0.95925
H  -2.756877 1.272146 0.981347
H  -2.720209 1.391446 -0.777386
H  5.016152 0.752777 1.217486
H  6.860396 0.724777 -0.420013
H  5.88901 -0.424267 -1.526868
H  -6.005187 0.318257 -0.074108
