program: Gaussian 09
title: 000000670
version: EM64L-G09RevD.01
frameworkgroup: C1[X(C3H6O3)]
method: RPBEPBE
basis: SDD
operation: Freq
keyword: #p
keyword: freq=noraman
keyword: PBEPBE/SDD
title: #p freq=noraman PBEPBE/SDD
converged: YES YES NO NO
title: Mulliken charges:
elementType: O O O C C C H H H H H H
charge: -0.440141 -0.440143 -0.254763 0.135789 -0.328545 -0.328545 0.231156 0.229481 0.231158 0.229481 0.367536 0.367537
chargesum: 0.00000
title: Mulliken charges with hydrogens summed into heavy atoms:
elementType: O O O C C C
charge: -0.072605 -0.072606 -0.254763 0.135789 0.132092 0.132094
polarizability: 5.11045097e+01 -2.55903802e-05 4.84361034e+01 7.49747429e-02 -2.98110131e-04 2.79306832e+01
1716.lowfreq: -17.1237 -7.0994 0.0006 0.0007 0.0009 8.2535 50.9157 88.0001 200.6443
frequency: 50.9134 87.9873 200.6443 304.3533 340.7773 362.4194 404.1633 469.5177 665.1498 832.7591 866.6209 966.0974 1036.5368 1045.8241 1126.3250 1160.8493 1206.2637 1255.8684 1257.9774 1377.1370 1388.5327 1442.7736 1451.0776 1606.0404 2940.4369 2946.5404 2998.8321 3006.4164 3456.0685 3462.4666
redmass: 2.1391 6.6112 5.0731 2.5505 1.7755 1.0574 5.2310 1.7367 4.4198 1.7285 2.9952 8.4203 4.6923 2.1480 2.0230 1.0828 1.1234 1.3039 1.6148 1.3086 1.3998 1.0736 1.0741 7.2319 1.0623 1.0695 1.0899 1.0957 1.0649 1.0648
irintensity: 0.7423 23.0412 8.4243 102.9499 122.7137 0.0676 1.3149 98.9003 2.7128 1.5707 14.9370 180.6788 43.8970 3.8307 8.4277 0.0004 14.5989 1.0978 185.4105 113.8708 25.8226 10.9043 13.7019 61.7460 35.7339 34.4888 16.1592 32.1988 7.8378 36.6108
temp: 298.150 k
press: 1.00000 atm
elementType: 8 8 8 6 6 6 1 1 1 1 1 1
symmnumber: 1
zpe: 237562.6 jmol-1
zpe.correction: 0.090483 hartree
zpe.thermalcorrener: 0.097632 hartree
zpe.thermalcorrenthalpy: 0.098577 hartree
zpe.thermalcorrgfe: 0.058952 hartree
zpe.sumelectzpe: -343.064955 hartree
zpe.sumelectthermal: -343.057805 hartree
zpe.sumelectthermalent: -343.056861 hartree
zpe.sumelectthermalfe: -343.096486 hartree
dipole: 0.0000 -1.8828 0.0001
dipole: 1.8828
quadrupole: -51.1830 -32.2341 -34.7598
quadrupole: 0.0000 1.0533 -0.0005
quadrupole: -11.7907 7.1582 4.6325 0.0000 1.0533 -0.0005
hfenergy: -343.1554375 hartree
pointgroup: C01 [X(C3H6O3)]
dipole: 0.0000042 -0.7407396 0.0002696 debye
dipolederiv: -0.6217751 0.2315366 -0.0171709 0.2361152 -0.4015511 -0.0149474 -0.0185926 0.00029 -0.5416455 -0.6217628 -0.231556 -0.0169886 -0.2361417 -0.4015544 0.0148134 -0.0184264 -0.0004115 -0.5416611 -0.627403 -0.000014 -0.042095 -0.0000192 -0.8725239 0.0002521 -0.0549867 0.0002346 -0.2991178 0.7360627 0.0000484 0.1234507 0.0000518 0.8904209 -0.0003626 0.1418001 -0.0003462 0.0799454 0.107481 -0.3721314 -0.0726916 -0.4719128 0.2122174 -0.0314884 -0.0955996 -0.0547006 0.3586229 0.1074708 0.3720734 -0.0729806 0.4718404 0.2123041 0.0316535 -0.0959747 0.0548415 0.3585462 0.054273 0.0433282 -0.0212678 0.0635805 -0.0117047 0.0891593 -0.0121805 0.1402982 -0.0139688 0.0110134 0.0577901 0.0469348 0.0690284 0.0164982 -0.075409 0.0540356 -0.12462 -0.0563645 0.0542779 -0.0433345 -0.0212272 -0.0635819 -0.01188 -0.0891662 -0.0121203 -0.1402996 -0.013788 0.0110112 -0.0577655 0.0469862 -0.0689912 0.0166473 0.0753468 0.0540954 0.1245606 -0.0565112 0.3946806 -0.1484505 0.0235844 -0.0482656 0.1755654 0.0114212 0.0289881 0.0050852 0.3629625 0.3946703 0.1484752 0.0234657 0.048296 0.1755609 -0.0112726 0.0289615 -0.004932 0.3629801 unknown
polarizability: 50.8948792|0.0009356|48.4361003|2.1953626|-0.0080254|28.1403169 unknown
InChI: InChI=1S/C3H6O3/c4-1-3(6)2-5/h4-5H,1-2H2
charge 0 multiplicity 1
12 atoms
O  -2.455305 0.050602 -0.184246
O  2.45529 0.05082 0.184221
O  -0.000009 1.194598 -0.000596
C  0.000003 -0.070884 -0.000066
C  -1.308946 -0.830476 -0.180195
C  1.308961 -0.830301 0.180739
H  -1.420093 -1.576072 0.632943
H  -1.248449 -1.394185 -1.137816
H  1.420173 -1.57653 -0.63181
H  1.248417 -1.393259 1.138798
H  -2.11525 0.988379 -0.205531
H  2.115208 0.988607 0.204758
