program: Gaussian 09
title: 000035856
version: EM64L-G09RevD.01
frameworkgroup: C1[X(C14H11N)]
method: RPBEPBE
basis: SDD
operation: Freq
keyword: #pfreq=noraman
keyword: PBEPBE/SDD
title: #p freq=noraman PBEPBE/SDD
converged: YES YES NO NO
title: Mulliken charges:
elementType: N C C C C C C C C C C C C C C H H H H H H H H H H H
charge: -0.013341 0.265587 0.268991 0.457594 -0.371155 -0.371146 -0.368137 -0.368110 -0.384239 -0.382946 -0.596165 -0.217636 -0.217338 -0.238916 -0.123436 0.248981 0.248981 0.236248 0.236252 0.243743 0.246797 0.256420 0.256417 0.227729 0.228649 0.230174
chargesum: 0.00000
title: Mulliken charges with hydrogens summed into heavy atoms:
elementType: N C C C C C C C C C C C C C C
charge: -0.013341 0.265587 0.268991 0.457594 -0.122174 -0.122166 -0.131889 -0.131857 -0.140497 -0.136149 -0.083328 0.010094 0.011312 -0.008742 -0.123436
polarizability: 2.19186054e+02 -1.37382512e+00 1.21695017e+02 -2.98652147e-03 1.69397388e-02 1.04382871e+02
1716.lowfreq: -64.7983 -14.5033 -7.0871 -2.5001 -0.0006 0.0002 0.0003 8.3376 41.3105
frequency: -64.7783 -13.7353 41.3104 77.6345 101.5568 207.8506 260.8094 266.3401 338.0001 352.4300 370.7017 396.9108 399.9553 463.7056 535.1386 542.2261 609.6965 619.6576 634.3214 704.6533 705.8878 749.4902 769.0464 802.1257 848.2771 849.0754 854.0295 908.9477 921.2873 925.7533 960.7307 972.6606 974.3796 987.1415 995.5895 996.7264 1018.8538 1041.7133 1077.5588 1113.5322 1172.3223 1180.0273 1186.8056 1193.2810 1203.6031 1286.8388 1293.3944 1305.2134 1308.7625 1364.7623 1368.4942 1400.8616 1427.8838 1449.4399 1473.7923 1512.3409 1576.5345 1583.3292 1610.7843 1623.4111 2197.0195 3000.1229 3054.4964 3123.3699 3123.7635 3125.5359 3129.1476 3141.2856 3148.8878 3150.2131 3154.2243 3165.1842
redmass: 3.7395 5.1546 6.8729 4.2290 7.0257 5.6504 3.4648 6.6322 2.8254 3.5429 5.6325 2.8537 2.8276 7.3926 3.2810 3.2284 5.7737 5.0958 6.4225 4.5052 1.7136 4.3430 1.9356 3.4329 1.2482 2.0063 1.2394 1.7501 1.4401 3.8317 1.4213 1.3837 1.3788 6.2174 1.3085 6.8844 2.7454 1.8998 1.6032 1.4043 1.0531 1.1127 1.1151 1.1045 2.5494 2.6539 1.5728 1.3267 1.3749 4.8795 6.6906 2.9444 2.2067 1.0898 2.1726 2.9932 6.8843 5.9928 6.1655 6.5649 12.4198 1.0590 1.1007 1.0845 1.0885 1.0885 1.0877 1.0925 1.0958 1.0969 1.0972 1.1018
irintensity: 0.0052 4.1395 1.6347 2.0816 2.4439 0.3431 0.1723 1.3073 0.4769 0.0638 1.9240 0.0021 0.0055 1.5693 14.2100 15.7814 3.8829 4.6304 0.5999 9.2335 55.1021 1.1290 45.1184 17.9711 0.0058 39.2853 0.0002 0.1587 1.5695 0.4008 0.0078 0.0172 0.0071 0.0030 0.1114 22.7609 0.2483 4.6825 7.8156 7.8932 0.0274 0.9875 1.1415 0.9705 0.6781 0.3808 0.5053 0.1431 0.6281 0.4917 0.1092 5.5824 7.5876 24.6916 36.7701 10.7579 0.0005 1.5301 6.2209 0.3683 11.1138 10.6199 2.7128 3.1537 3.8578 19.0607 0.2328 17.3008 22.4782 37.8405 0.0588 23.2370
temp: 298.150 k
press: 1.00000 atm
elementType: 7 6 6 6 6 6 6 6 6 6 6 6 6 6 6 1 1 1 1 1 1 1 1 1 1 1
symmnumber: 1
zpe: 534915.2 jmol-1
zpe.correction: 0.203738 hartree
zpe.thermalcorrener: 0.214580 hartree
zpe.thermalcorrenthalpy: 0.215525 hartree
zpe.thermalcorrgfe: 0.166136 hartree
zpe.sumelectzpe: -593.804400 hartree
zpe.sumelectthermal: -593.793558 hartree
zpe.sumelectthermalent: -593.792613 hartree
zpe.sumelectthermalfe: -593.842002 hartree
dipole: 2.6600 -3.1906 0.0087
dipole: 4.1540
quadrupole: -95.2717 -88.2965 -83.8276
quadrupole: 18.2923 -0.0513 0.0265
quadrupole: -6.1398 0.8354 5.3044 18.2923 -0.0513 0.0265
hfenergy: -594.0081381 hartree
pointgroup: C01 [X(C14H11N1)]
dipole: -1.0630283 1.2413476 0.0014416 debye
dipolederiv: -0.299047 0.0101795 0.0000108 0.1666474 -0.2342764 -0.0000157 0.0001887 -0.0000069 -0.2277199 0.3735602 0.0633281 0.0000565 0.069701 -0.0664475 -0.0000679 0.0000852 0.000001 0.0002051 0.3401197 0.0344735 0.0000297 0.0479122 0.0094888 0.0000482 0.0000462 -0.0000211 -0.0751739 0.3355966 -0.0321415 -0.0000475 -0.0111907 -0.1230091 -0.0001142 -0.00002 -0.0001173 -0.0129622 -0.1854928 -0.0031045 0.0671308 -0.0077086 -0.1081399 0.0109 0.0320636 0.0030271 0.0713161 -0.1854841 -0.0030022 -0.0671083 -0.0077869 -0.1081374 -0.0112969 -0.0320696 -0.0033999 0.0712945 -0.1236276 0.0284259 -0.0622369 0.0043151 -0.1393619 0.0048367 -0.0241269 -0.0089625 0.0599028 -0.1236596 0.0282662 0.0623286 0.0044592 -0.13934 -0.0053205 0.0241711 0.0084371 0.0598973 -0.1980224 0.0393099 0.0000184 -0.0299301 0.0636561 -0.0000177 0.0001638 -0.0000195 -0.13189 -0.1797236 -0.0943113 -0.0000199 -0.0380002 0.0357908 -0.000035 -0.0001787 -0.0000567 -0.1297527 0.1444904 0.0759166 0.0000928 0.0867923 0.0994171 -0.0001421 0.0000761 -0.0001362 0.2246168 -0.0014554 -0.0831578 0.0000354 -0.0676072 0.0660761 -0.0000889 -0.0000736 -0.0000713 -0.1459012 -0.0347681 0.0558351 0.0000136 0.0372874 0.1032135 -0.0000752 0.0001199 -0.0000366 -0.1448468 0.0841066 0.0241713 0.0000349 0.0231848 -0.073996 -0.0000232 0.000031 -0.0000261 -0.1670295 -0.0816873 -0.1192195 -0.0001339 -0.2377703 0.1136116 0.0001906 -0.0002604 0.0001815 -0.0506026 0.0496554 -0.0060248 -0.0877929 -0.0147959 0.1319803 -0.0107492 -0.096169 -0.0098164 -0.0306269 0.0496727 -0.0062737 0.0877586 -0.0150246 0.1319225 0.011185 0.0961199 0.0101781 -0.0305972 0.002793 -0.0287335 0.0981448 -0.021298 0.1374701 0.0130703 0.1018856 0.0089887 -0.0406577 0.0027638 -0.0284876 -0.0982237 -0.0210476 0.1375222 -0.0126151 -0.101946 -0.0085418 -0.0406826 0.0849209 -0.0824768 0.0000349 -0.0798825 -0.0645603 0.0000325 0.0000028 0.0000675 0.1367981 0.034198 0.1035886 -0.000063 0.105205 -0.009496 0.0000345 -0.0000407 0.000075 0.137062 0.0297853 0.0152984 -0.0165641 0.0091437 0.0470631 -0.0384004 -0.0742751 -0.0915967 -0.0016918 0.029818 0.0152902 0.0165844 0.008984 0.0467688 0.0385104 0.0742959 0.0916988 -0.001417 -0.0296377 0.0958825 -0.0000556 0.115691 -0.0450339 0.0000753 -0.0000706 0.0000725 0.1540586 0.0250712 -0.0720027 0.0000058 -0.095095 -0.0952385 0.0000611 0.0000153 0.0000634 0.1540697 -0.1439462 -0.03103 -0.0000341 -0.0321855 0.0830558 0.0000172 -0.0000345 0.0000181 0.1623311 unknown
polarizability: 219.2053358|-0.085021|121.6756371|0.0038064|-0.0444861|104.3829687 unknown
InChI: InChI=1S/C14H11N/c15-11-10-12-6-8-14(9-7-12)13-4-2-1-3-5-13/h1-9H,10H2
charge 0 multiplicity 1
26 atoms
N  5.282304 -1.501958 -0.001948
C  -0.413533 0.202573 0.000166
C  -1.901104 -0.006075 0.000004
C  2.416603 0.601163 0.000497
C  0.305586 0.305013 -1.218767
C  0.305739 0.301914 1.219271
C  1.703977 0.501616 -1.218372
C  1.704126 0.49852 1.219201
C  -2.786072 1.103715 -0.000501
C  -2.445913 -1.316831 0.000353
C  3.934951 0.80526 0.000661
C  -4.185982 0.907046 -0.000644
C  -3.84585 -1.513622 0.000193
C  -4.720228 -0.402277 -0.0003
C  4.684566 -0.469201 -0.000776
H  -0.235443 0.230506 -2.168456
H  -0.235179 0.225039 2.168833
H  2.241427 0.574237 -2.171649
H  2.241699 0.568747 2.172589
H  -2.374193 2.11938 -0.000754
H  -1.769681 -2.179275 0.000714
H  4.248177 1.384812 0.889247
H  4.248098 1.386765 -0.886676
H  -4.857159 1.773393 -0.001012
H  -4.251777 -2.531503 0.000442
H  -5.805338 -0.554659 -0.000417
