program: Gaussian 09
title: 000035853
version: EM64L-G09RevD.01
frameworkgroup: C1[X(C12H8Cl2O2)]
method: RPBEPBE
basis: SDD
operation: Freq
keyword: #p
keyword: freq=noraman
keyword: PBEPBE/SDD
title: #p freq=noraman PBEPBE/SDD
converged: NO YES NO NO
title: Mulliken charges:
elementType: Cl Cl O O C C C C C C C C C C C C H H H H H H H H
charge: -0.056799 -0.056820 -0.179150 -0.179332 0.331592 0.330974 0.269023 0.268793 -0.151082 -0.149615 -0.358084 -0.358084 -0.792030 -0.791798 -0.221156 -0.221118 0.324035 0.296444 0.323989 0.296447 0.291214 0.291212 0.245673 0.245671
chargesum: 0.00000
title: Mulliken charges with hydrogens summed into heavy atoms:
elementType: Cl Cl O O C C C C C C C C C C C C
charge: -0.056799 -0.056820 -0.179150 -0.179332 0.331592 0.330974 0.269023 0.268793 -0.151082 -0.149615 -0.066870 -0.066872 -0.171551 -0.171362 0.024518 0.024553
polarizability: 2.07922835e+02 -3.71647097e-02 1.74033197e+02 -5.84932645e-02 -1.61088017e+01 9.31532825e+01
1716.lowfreq: -0.0017 0.0022 0.0026 5.1859 7.9137 8.1302 40.5235 44.5096 55.1599
frequency: 40.5149 44.4774 55.1347 75.0619 108.6240 122.4078 169.0439 184.7070 243.5907 310.8289 313.7783 343.4257 378.7477 398.2706 418.7979 440.4922 448.9074 489.9083 544.0894 601.4067 631.2585 639.9084 657.5217 659.1302 721.0351 739.8526 785.6268 810.3034 845.7918 878.7141 928.1981 942.2730 958.5081 999.4371 1016.7493 1022.2356 1032.7909 1088.2524 1116.1176 1167.9059 1173.2312 1185.2436 1202.4709 1259.2409 1275.4309 1278.0805 1296.2964 1337.3642 1401.5420 1439.2517 1449.2747 1458.0341 1472.5101 1535.4550 1548.4501 1585.4608 1606.6573 1622.5612 3074.4781 3076.8852 3141.7950 3155.7227 3163.0421 3165.4906 3166.0689 3175.6966
redmass: 9.4685 17.7501 11.0122 8.2822 13.1408 5.0111 13.1712 6.7249 3.9984 5.6073 2.4599 4.4387 8.6587 7.8231 3.9176 6.2838 6.4161 7.4180 8.1901 6.9274 7.2123 5.9322 6.4068 4.0509 5.1219 2.4937 3.1862 2.0101 4.0520 2.2182 1.5639 3.5176 2.5451 1.3947 1.3673 2.0567 2.0858 2.3157 1.5596 1.5732 1.1082 1.7118 1.8583 1.3079 1.5066 1.1766 5.2680 3.4801 10.0725 1.8445 1.4045 1.1511 2.5545 8.7787 9.1017 7.8487 6.6606 9.1926 1.0568 1.0569 1.0866 1.0903 1.1108 1.1110 1.0950 1.1006
irintensity: 2.0637 1.0776 0.3252 4.5464 3.8026 0.0145 2.9223 0.7975 2.9177 4.0998 0.1839 0.7626 9.4585 13.7395 2.5082 15.8782 10.0663 0.4403 35.5052 6.0099 35.1050 9.0925 1.0374 1.3922 0.0070 92.1455 4.1649 20.4142 1.7842 0.4210 1.2048 14.3405 29.3527 3.4487 0.0077 2.5419 1.4058 5.1648 18.7251 0.1049 11.2867 9.1006 5.2456 7.7209 6.7865 0.6116 383.0880 14.7402 0.0007 11.0358 49.1030 37.1312 4.5240 20.2457 219.6817 15.9969 0.6371 8.6295 4.1276 5.0786 3.3189 3.6147 1.5774 5.0281 0.6952 21.8593
temp: 298.150 k
press: 1.00000 atm
elementType: 17 17 8 8 6 6 6 6 6 6 6 6 6 6 6 6 1 1 1 1 1 1 1 1
symmnumber: 1
zpe: 440342.8 jmol-1
zpe.correction: 0.167718 hartree
zpe.thermalcorrener: 0.181728 hartree
zpe.thermalcorrenthalpy: 0.182672 hartree
zpe.thermalcorrgfe: 0.124826 hartree
zpe.sumelectzpe: -1531.526145 hartree
zpe.sumelectthermal: -1531.512135 hartree
zpe.sumelectthermalent: -1531.511191 hartree
zpe.sumelectthermalfe: -1531.569037 hartree
dipole: -3.8070 -0.0024 -0.0032
dipole: 3.8070
quadrupole: -89.2644 -119.9655 -107.7232
quadrupole: 0.0122 -0.0107 -2.5842
quadrupole: 16.3867 -14.3145 -2.0722 0.0122 -0.0107 -2.5842
hfenergy: -1531.6938631 hartree
pointgroup: C01 [X(C12H8Cl2O2)]
dipole: 1.4977836 -0.0004821 0.0013277 debye
dipolederiv: -0.3705164 0.1918905 -0.1109096 0.1370669 -0.2738908 0.0648391 -0.2431001 0.1901222 -0.3592735 -0.3718782 -0.1926112 0.1112968 -0.1370699 -0.2738036 0.0645515 0.2433596 0.1896964 -0.3586937 -0.6391732 -0.0138669 0.0028697 0.2002659 -0.8750624 -0.1134242 0.0588092 -0.1389665 -0.3222404 -0.639214 0.0137989 -0.0029537 -0.2003177 -0.8753279 -0.1111352 -0.0597402 -0.1402892 -0.3220701 -0.2456764 -0.3682424 0.0558063 -0.4546623 -0.140394 -0.0297482 -0.0249896 -0.1344091 -0.060586 -0.2447668 0.3682193 -0.0555393 0.4544937 -0.1407755 -0.0292604 0.0239994 -0.1352829 -0.0611319 -0.5832894 0.2231317 0.0606357 0.3470043 -0.0897674 -0.0280864 0.0721203 -0.0229658 0.0065888 -0.5832816 -0.2231171 -0.0604741 -0.3474219 -0.089761 -0.0274729 -0.0701098 -0.0233592 0.0064658 1.4008501 0.1583834 -0.0424283 -0.1583755 0.8788096 0.1540869 -0.056638 0.1703582 0.2029443 1.4004771 -0.1583354 0.0425372 0.1586751 0.879475 0.1520202 0.0564472 0.1701446 0.2029578 -0.1718388 -0.1298723 -0.039047 0.1177588 0.0972344 0.040535 0.0342954 0.0387751 -0.0834442 -0.17189 0.1298782 0.0391102 -0.1178082 0.0972562 0.040541 -0.0337023 0.0387306 -0.0835072 0.201327 -0.1894674 0.1727862 -0.203157 0.2446908 -0.1040186 0.2172314 -0.1207954 0.4243285 0.2026314 0.1901295 -0.1737188 0.2037794 0.2446001 -0.1038533 -0.2180753 -0.119938 0.4235208 0.1857009 0.1475944 0.0325774 0.0523364 -0.0417744 0.0144632 0.0103567 0.0183348 -0.1288037 0.1856765 -0.1474346 -0.0334026 -0.0521558 -0.0419195 0.0146609 -0.0112323 0.018838 -0.1286325 0.167852 -0.064735 -0.0701392 0.0646449 0.0355425 -0.0103811 -0.0517291 -0.0008036 0.016875 -0.006617 0.0227194 -0.0116785 -0.038459 0.0914666 0.062077 -0.0272524 0.0518914 0.0042551 0.16774 0.0647356 0.0703766 -0.0648078 0.0355117 -0.0104464 0.052097 -0.0006298 0.0171634 -0.0067178 -0.0226986 0.0117866 0.0383348 0.0915476 0.062235 0.0272368 0.0518052 0.0043376 0.1240113 0.0417507 0.0075894 -0.0246409 0.0151176 -0.0300096 -0.0072817 -0.0300643 0.147463 0.1239876 -0.041776 -0.0075018 0.024616 0.0151161 -0.0300436 0.0073548 -0.0300807 0.1474627 -0.0627071 -0.0718901 -0.0150793 -0.0828615 0.0580082 -0.0209669 -0.0189043 -0.0204115 0.1520647 -0.0626874 0.0718154 0.0155002 0.0827615 0.0581001 -0.0211629 0.0194472 -0.0207007 0.1519555 unknown
polarizability: 207.9228186|0.0367937|176.6317083|-0.0660634|6.5249422|90.5547876 unknown
InChI: InChI=1S/C12H8Cl2O2/c13-5-9-10(6-14)12(16)8-4-2-1-3-7(8)11(9)15/h1-4H,5-6H2
charge 0 multiplicity 1
24 atoms
Cl -3.38192 1.901736 -1.356205
Cl -3.387078 -1.900325 1.35335
O  -0.096166 2.671406 0.61033
O  -0.0965 -2.671462 -0.609796
C  -1.357645 0.6744 0.14933
C  -1.357725 -0.674789 -0.146857
C  1.213274 0.695141 0.152756
C  1.213198 -0.695987 -0.149628
C  -0.070629 1.432705 0.323032
C  -0.070801 -1.434144 -0.316613
C  2.441087 1.384648 0.300222
C  2.440943 -1.384981 -0.300025
C  -2.620818 1.462886 0.341843
C  -2.620929 -1.462412 -0.342666
C  3.660721 0.693086 0.148183
C  3.66065 -0.692924 -0.150853
H  -2.416064 2.433137 0.811475
H  -3.406145 0.900378 0.864815
H  -2.415566 -2.432924 -0.811494
H  -3.404396 -0.899461 -0.867945
H  2.414901 2.453776 0.532534
H  2.414647 -2.454138 -0.532192
H  4.609792 1.227173 0.261597
H  4.609669 -1.226626 -0.266494
