program: Gaussian 09
title: 000035896
version: EM64L-G09RevD.01
frameworkgroup: C1[X(C15H22N2O2)]
method: RPBEPBE
basis: SDD
operation: Freq
keyword: #p
keyword: freq=noraman
keyword: PBEPBE/SDD
title: #p freq=noraman PBEPBE/SDD
converged: YES YES NO NO
title: Mulliken charges:
elementType: O O N N C C C C C C C C C C C C C C C H H H H H H H H H H H H H H H H H H H H H H
charge: -0.329088 -0.258738 -0.062224 -0.482261 0.052422 -0.457958 -0.437363 -0.391436 -0.365062 -0.622037 0.242566 0.133914 0.363468 0.338167 -0.411113 -0.419879 -0.828401 -0.833275 -0.233178 0.249870 0.203875 0.226830 0.179788 0.256262 0.213666 0.199750 0.213472 0.171352 0.187206 0.223515 0.230921 0.325642 0.232358 0.232081 0.285255 0.222494 0.217434 0.235152 0.244557 0.224735 0.225262
chargesum: 0.00000
title: Mulliken charges with hydrogens summed into heavy atoms:
elementType: O O N N C C C C C C C C C C C C C C C
charge: -0.329088 -0.258738 -0.062224 -0.156619 0.302292 -0.027253 -0.001313 0.021980 0.019761 0.019604 0.242566 0.133914 0.363468 0.338167 -0.178755 -0.187798 -0.103217 -0.128830 -0.007916
polarizability: 2.43418139e+02 -7.20161245e+00 1.70506153e+02 -1.40542325e+01 -1.11461237e+01 1.37618099e+02
1716.lowfreq: -10.8626 -0.0009 -0.0003 0.0004 4.1141 5.9127 21.9563 27.8707 46.4925
frequency: 21.4920 27.6639 46.4472 71.8122 90.8219 95.0188 138.6546 157.8070 168.3609 177.3826 191.4463 206.5685 227.8034 236.1405 246.9054 288.3151 296.2133 314.6876 320.3237 350.8843 392.9109 414.7754 445.1131 455.1122 467.1232 512.2349 516.7726 521.8731 543.0677 572.4770 593.4873 674.0580 696.7767 707.4522 750.8274 767.1783 778.4994 830.1097 865.8269 867.8612 895.5280 898.8669 912.0711 936.8333 957.4804 974.7139 980.2536 987.5757 1003.3580 1026.0655 1039.9022 1045.7407 1053.5862 1069.5089 1094.6832 1098.6176 1123.8448 1127.7745 1144.1697 1155.8941 1170.6750 1177.6486 1209.1521 1230.0465 1249.9916 1260.8388 1261.9273 1280.2756 1280.8762 1292.0701 1316.5486 1338.3489 1348.8437 1358.2714 1368.3539 1372.3719 1400.4067 1401.3102 1431.8262 1434.2920 1453.9426 1454.8712 1457.8472 1459.7587 1462.2657 1470.6795 1471.8432 1478.0558 1479.3871 1482.7588 1487.9259 1493.6649 1604.5842 1604.9543 1669.6259 2815.4286 2833.5106 2859.7627 2963.1437 2980.6795 2986.6720 2994.5207 3019.4104 3029.9908 3036.8653 3041.3946 3049.4200 3054.9273 3062.9965 3067.0158 3078.3750 3088.3801 3090.0954 3121.4162 3131.4184 3156.8140 3533.5370
redmass: 3.2746 4.6744 4.4915 5.0777 5.2369 3.3291 2.5278 3.3072 1.1284 1.3808 2.5554 2.0617 1.8426 1.7499 2.2578 3.1697 3.5905 3.1004 3.3492 2.3225 2.5113 3.9349 4.0230 2.5709 2.9336 3.4094 3.0708 3.2621 3.2230 3.3596 1.3838 6.1539 7.3606 5.1171 5.2168 2.4790 1.2218 4.0661 2.9230 1.4100 3.1620 1.3104 2.4972 2.8397 1.7261 1.3619 2.2325 1.6486 5.3619 1.7965 1.7044 1.6411 1.5852 1.7664 1.5590 1.7276 1.6314 1.7548 1.5584 3.1776 2.4098 1.1926 1.6916 3.2970 1.7799 1.3555 1.5275 1.6098 2.2753 1.3075 1.3046 1.4285 1.5165 1.5362 3.3444 1.8366 1.2398 1.2673 1.1840 1.9080 1.7110 1.1047 1.1498 1.0758 1.0642 1.0962 1.0955 1.4636 1.0949 1.0543 1.3025 1.6003 5.8758 6.6473 8.7417 1.0710 1.0682 1.0579 1.0419 1.0364 1.0615 1.0620 1.0726 1.0868 1.0855 1.0925 1.0923 1.0986 1.0970 1.1013 1.1009 1.0998 1.0981 1.0857 1.0919 1.0995 1.0755
irintensity: 0.0740 0.7082 0.4415 0.8534 2.9306 0.7853 2.6495 3.1595 0.4421 0.4708 0.8563 8.0540 0.9758 6.8336 1.9235 3.1821 5.4680 0.0690 5.2688 8.7085 4.7957 0.4277 9.5193 2.5957 3.2953 0.3943 1.2094 0.7790 13.0140 0.6462 80.1318 3.1407 16.9644 23.9794 8.9836 2.9928 56.3986 4.4872 7.9049 6.0126 0.6966 0.2129 7.9077 6.8644 0.4419 3.7264 40.7700 28.2341 330.9488 16.6822 4.8772 8.0263 14.0284 23.0190 11.8407 2.2772 26.4709 11.1563 51.5672 407.9014 19.3824 7.9549 7.0787 24.7728 4.8948 18.6431 0.4983 5.9019 6.8919 3.5732 1.5548 4.2894 1.8218 10.0666 40.7664 0.8133 34.5658 0.9419 4.4622 41.6323 53.0456 9.5407 28.7791 0.1390 29.1801 7.8393 14.2845 191.9632 11.8316 9.4134 31.5639 211.4638 8.1225 5.8059 207.2794 74.1864 70.2595 190.2194 33.6432 23.0021 23.7446 32.7466 42.2142 69.5886 0.9512 19.5552 34.7507 10.8961 11.1301 59.9706 36.4052 21.1614 21.9458 0.3092 25.8094 34.2853 26.9994
temp: 298.150 k
press: 1.00000 atm
elementType: 8 8 7 7 6 6 6 6 6 6 6 6 6 6 6 6 6 6 6 1 1 1 1 1 1 1 1 1 1 1 1 1 1 1 1 1 1 1 1 1 1
symmnumber: 1
zpe: 910877.2 jmol-1
zpe.correction: 0.346935 hartree
zpe.thermalcorrener: 0.366198 hartree
zpe.thermalcorrenthalpy: 0.367142 hartree
zpe.thermalcorrgfe: 0.298535 hartree
zpe.sumelectzpe: -843.309975 hartree
zpe.sumelectthermal: -843.290712 hartree
zpe.sumelectthermalent: -843.289768 hartree
zpe.sumelectthermalfe: -843.358375 hartree
dipole: 0.8147 1.4771 -2.4521
dipole: 2.9763
quadrupole: -99.6650 -107.6976 -117.1834
quadrupole: 0.0398 -1.6604 -0.0346
quadrupole: 8.5170 0.4843 -9.0014 0.0398 -1.6604 -0.0346
hfenergy: -843.6569102 hartree
pointgroup: C01 [X(C15H22N2O2)]
dipole: -0.3529765 0.3141581 1.0713913 debye
polarizability: 243.5544025|11.5070656|163.4100919|-9.6644101|17.8146177|144.5778959 unknown
InChI: InChI=1S/C15H22N2O2/c1-11-6-4-7-12(2)14(11)16-15(18)19-13-8-5-9-17(3)10-13/h4,6-7,13,16H,5,8-10H2,1-3H3
charge 0 multiplicity 1
41 atoms
O  -1.061619 -0.392025 0.865257
O  0.046995 -0.333112 -1.223178
N  -4.267293 0.66151 -0.829902
N  1.182472 -0.112453 0.845236
C  -2.372242 -0.565475 0.171327
C  -3.306641 -1.251001 1.174543
C  -2.913451 0.814566 -0.252203
C  -4.737929 -1.320874 0.589983
C  -5.217103 0.076062 0.144815
C  -4.762327 1.910177 -1.438589
C  0.074321 -0.281894 0.030696
C  2.536401 0.075723 0.402147
C  3.171138 -0.881923 -0.441936
C  3.234803 1.22327 0.885397
C  4.514855 -0.640243 -0.824643
C  4.580363 1.412792 0.494488
C  2.465204 -2.139427 -0.905372
C  2.545385 2.227605 1.792823
C  5.217963 0.492826 -0.366127
H  -2.214275 -1.183263 -0.731144
H  -3.31212 -0.660683 2.112552
H  -2.926761 -2.259221 1.419631
H  -2.909825 1.488294 0.645653
H  -2.244948 1.250621 -1.015175
H  -4.75482 -1.996475 -0.286245
H  -5.433595 -1.731728 1.345643
H  -6.209297 0.001179 -0.337774
H  -5.332379 0.733812 1.048833
H  -4.900952 2.740282 -0.699601
H  -5.734665 1.72494 -1.929599
H  -4.050742 2.255121 -2.209665
H  0.971508 0.023797 1.836391
H  5.014048 -1.365603 -1.47768
H  5.122908 2.293627 0.857291
H  1.738359 -1.909347 -1.705146
H  1.89273 -2.605439 -0.081735
H  3.191528 -2.877708 -1.285427
H  3.174872 3.121931 1.934276
H  1.575407 2.55244 1.372925
H  2.341424 1.812088 2.800748
H  6.257899 0.654631 -0.670417
