program: Gaussian 09
title: 000035862
version: EM64L-G09RevD.01
frameworkgroup: C1[X(C10H9N3O3S)]
method: RPBEPBE
basis: SDD
operation: Freq
keyword: #p
keyword: freq=noraman
keyword: PBEPBE/SDD
title: #p freq=noraman PBEPBE/SDD
converged: YES YES NO NO
title: Mulliken charges:
elementType: S O O O N N N C C C C C C C C C C H H H H H H H H H
charge: 0.227268 -0.264483 -0.194913 -0.197916 -0.343385 0.028767 0.020250 0.308978 0.202014 -0.329805 -0.322777 0.392201 -0.470391 -0.354606 -0.366402 -0.088905 -0.826711 0.288565 0.229380 0.341569 0.328738 0.294329 0.292922 0.279650 0.265584 0.260079
chargesum: 0.00000
title: Mulliken charges with hydrogens summed into heavy atoms:
elementType: S O O O N N N C C C C C C C C C C
charge: 0.227268 -0.264483 -0.194913 -0.197916 -0.014647 0.028767 0.020250 0.308978 0.202014 -0.041240 -0.093397 0.392201 -0.128822 -0.060277 -0.073480 -0.088905 -0.021398
polarizability: 2.41336881e+02 -7.64169432e+00 1.20944286e+02 5.18321297e+00 -1.25091069e+01 1.35595469e+02
1716.lowfreq: -4.7092 -0.0013 0.0007 0.0020 2.9893 11.3987 24.5219 28.5670 48.3563
frequency: 24.5125 28.5625 48.3439 60.9058 62.5607 76.2808 92.4514 119.3187 122.8305 178.5963 202.9062 232.2408 259.1451 269.9727 306.7816 339.8771 407.4862 419.9391 446.6842 461.8812 488.8390 514.1774 571.0488 578.3876 623.9033 651.2820 656.3531 665.5297 687.7977 712.6829 765.4807 785.5515 845.4955 848.4369 884.9176 950.6929 969.5359 986.8737 998.8446 1003.4880 1011.1276 1047.8119 1091.5944 1112.5991 1133.7982 1185.5775 1217.6791 1218.4572 1249.8643 1298.0812 1305.6161 1348.8614 1368.3306 1402.6646 1409.2822 1442.2933 1457.9640 1459.8600 1486.8397 1576.2818 1607.4694 1609.6505 2198.6041 3013.7527 3038.0247 3133.7553 3137.7099 3140.4228 3168.0317 3185.9280 3189.1029 3562.8662
redmass: 5.9806 5.9079 3.4766 7.9847 7.3143 6.0480 8.1089 3.6442 1.4399 7.7813 5.1653 6.4036 8.4922 6.7641 9.4880 4.9090 2.8652 6.6388 8.3565 5.3551 7.8724 6.6155 5.8652 1.3233 6.7462 6.7740 6.3798 6.4995 4.3709 6.5608 4.8492 9.1228 3.6020 1.6375 1.5910 2.5382 1.1869 1.3685 1.6958 2.9100 1.4443 4.6296 3.1326 1.3334 2.8800 1.3852 1.4195 3.4844 1.7211 1.3508 1.6139 1.1321 6.8013 10.6725 3.9903 1.0577 1.0876 1.7900 2.2772 7.5640 6.8625 6.7478 12.5647 1.0289 1.0828 1.1044 1.0905 1.1048 1.0899 1.0946 1.0966 1.0780
irintensity: 0.5184 1.6372 0.8129 3.0727 2.8578 4.9378 7.4392 0.6146 0.9528 11.3525 1.4094 4.9227 0.3319 11.0806 3.2169 6.3589 0.3444 2.2009 12.0972 2.2716 4.6372 0.5840 14.4582 90.3606 1.3408 9.6643 3.8846 8.0969 32.3614 80.0112 4.2076 37.1684 2.0765 20.2468 47.1323 4.7160 5.7353 1.8068 19.4164 9.2406 0.2975 15.4712 23.3178 42.1334 69.2654 33.8186 33.5898 301.9827 37.7605 31.9617 122.9947 2.4289 88.6710 0.2624 40.6581 22.1583 20.5659 226.6772 127.5188 95.9509 27.9645 11.4906 3.4574 12.6913 25.8719 13.7664 10.3756 7.0734 1.4439 1.7613 1.7623 22.5395
temp: 298.150 k
press: 1.00000 atm
elementType: 16 8 8 8 7 7 7 6 6 6 6 6 6 6 6 6 6 1 1 1 1 1 1 1 1 1
symmnumber: 1
zpe: 473484.9 jmol-1
zpe.correction: 0.180341 hartree
zpe.thermalcorrener: 0.197223 hartree
zpe.thermalcorrenthalpy: 0.198167 hartree
zpe.thermalcorrgfe: 0.132561 hartree
zpe.sumelectzpe: -1173.131758 hartree
zpe.sumelectthermal: -1173.114876 hartree
zpe.sumelectthermalent: -1173.113932 hartree
zpe.sumelectthermalfe: -1173.179538 hartree
dipole: -1.1465 -2.4744 -1.3618
dipole: 3.0482
quadrupole: -150.1691 -110.6058 -105.6035
quadrupole: 13.5931 7.8301 0.2165
quadrupole: -28.0430 11.5203 16.5227 13.5931 7.8301 0.2165
hfenergy: -1173.3120989 hartree
pointgroup: C01 [X(C10H9N3O3S1)]
dipole: 0.3631631 0.9623791 0.6165946 debye
dipolederiv: -0.3521148 -0.0029784 -0.0377635 -0.1599829 -0.1747257 -0.086887 -0.0764077 -0.0867895 -0.1061066 -0.8248001 0.0837528 -0.1578422 -0.0663644 -0.4559984 0.2133138 0.1643548 0.257864 -0.7592043 -0.8134534 -0.1605843 0.1153521 -0.1399583 -0.412615 0.192796 0.0965395 0.1930634 -0.4135117 -0.7110419 0.0989969 -0.1517242 0.1162802 -0.4305434 0.2362073 -0.1684768 0.2333253 -0.4852878 -1.4296135 -0.4141541 0.3008282 -0.1468867 -0.5409804 -0.0439491 0.4240999 0.0529417 -0.5755361 1.883777 0.0471072 0.1082789 -0.0037261 0.6099707 -0.4489181 0.1560034 -0.4417145 0.6782243 -0.2005412 0.0332449 0.000828 0.0403627 -0.1895738 0.0088968 0.0559869 -0.0492166 -0.2242722 -0.2690447 0.010997 -0.028193 0.0282925 0.0658683 -0.021416 -0.082066 -0.0227597 0.0096134 1.7594326 0.1167168 -0.1089816 0.2617347 0.4133791 -0.3947382 -0.5970493 -0.4779872 1.0159914 -0.2293425 -0.1289675 0.123874 -0.0516234 -0.0359216 -0.0606498 -0.0040747 -0.087464 -0.0019891 -0.1466268 0.1157015 -0.1204261 0.1231938 -0.0588149 -0.0447237 -0.0179324 -0.0488719 -0.0892347 -0.6564033 0.0026596 -0.0732891 0.0605299 0.0741966 -0.0046683 -0.1240578 -0.0091421 0.0627164 1.1691388 0.3427253 -0.0007009 0.0580731 0.585423 0.2126309 0.2924558 0.1496865 0.1211281 0.1146783 0.1223966 -0.1120382 -0.0900762 -0.0730321 -0.035583 0.115515 -0.0196048 -0.0705526 0.0525306 -0.0935619 0.1144658 0.0654683 -0.0672175 -0.0192574 -0.0554048 -0.0352518 -0.0633215 -0.1370606 -0.1060505 -0.0665534 -0.0678446 -0.0962441 -0.0262412 -0.0718663 0.1120036 0.0843303 0.0550096 -0.0637905 -0.0361316 -0.0580726 -0.0355869 0.0206392 -0.0160028 0.0542566 0.1342697 0.1272761 0.0393762 -0.0421959 0.0382661 0.1057576 0.0478239 -0.011329 0.060904 0.0882126 0.0027994 -0.0711537 0.0648396 -0.0951793 0.0662921 0.061756 0.0729972 0.0708835 0.0722642 0.1487564 -0.0214653 0.0280572 0.0497358 0.0103764 -0.0390774 -0.1126698 -0.0092581 0.088292 0.1984326 0.0016441 -0.0132994 0.0202205 0.2917341 0.094704 -0.0646394 0.0671826 0.1814759 0.0882069 -0.043166 0.0382957 -0.0220869 0.1285282 0.0429217 0.01322 0.0406988 0.1284767 0.1116421 0.026557 -0.0347764 0.0075617 0.1171348 0.05533 -0.0168365 0.0557073 0.1119135 0.1003268 0.0515437 0.0457003 0.0575437 0.0137576 0.1009038 0.0050054 0.0407657 -0.0429791 -0.1215898 0.0626963 0.0374004 0.0463334 0.1188164 0.0092731 0.0166363 -0.0260366 -0.0080011 0.0796253 -0.0502436 0.0059951 -0.0717953 -0.029981 -0.0710875 0.0059991 -0.0751861 0.0630883 unknown
polarizability: 240.070925|12.1572702|123.4983031|-8.0152952|-14.0030606|134.3074068 unknown
InChI: InChI=1S/C10H9N3O3S/c1-17-9(6-11)12-10(14)7-2-4-8(5-3-7)13(15)16/h2-5,9,12H,1H3
charge 0 multiplicity 1
26 atoms
S  4.243117 1.871621 -0.027679
O  1.592265 -0.782134 1.654858
O  -5.309363 -0.662243 0.393368
O  -4.981212 0.894502 -1.242366
N  2.035209 0.14231 -0.432234
N  -4.551015 0.082882 -0.336327
N  4.757105 -1.06574 -2.238231
C  -0.310785 -0.154471 0.28069
C  1.162596 -0.289003 0.567113
C  -1.191283 -0.945317 1.064002
C  -0.84252 0.729417 -0.695826
C  -3.08042 0.000605 -0.119441
C  3.477238 0.116457 -0.224455
C  -2.582061 -0.877696 0.867089
C  -2.232727 0.812682 -0.902025
C  4.186646 -0.539031 -1.332521
C  3.471645 2.295852 1.638747
H  -0.759135 -1.601418 1.825326
H  -0.191119 1.38819 -1.281039
H  3.655274 -0.422074 0.724196
H  1.685894 0.492269 -1.325566
H  -3.278871 -1.481547 1.453762
H  -2.667823 1.488902 -1.642099
H  3.732279 1.530923 2.385179
H  2.379039 2.388801 1.547401
H  3.903727 3.26616 1.929676
