program: Gaussian 09
title: 000035841
version: EM64L-G09RevD.01
frameworkgroup: C1[X(C6H9N)]
method: RPBEPBE
basis: SDD
operation: Freq
keyword: #p
keyword: freq=noraman
keyword: PBEPBE/SDD
title: #p freq=noraman PBEPBE/SDD
converged: YES YES NO NO
title: Mulliken charges:
elementType: N C C C C C C H H H H H H H H H
charge: -0.022064 -0.432274 -0.218405 -0.661808 0.311097 -0.778460 -0.253107 0.211943 0.220921 0.240991 0.226558 0.223172 0.217912 0.244286 0.243839 0.225400
chargesum: 0.00000
title: Mulliken charges with hydrogens summed into heavy atoms:
elementType: N C C C C C C
charge: -0.022064 0.000590 0.022586 0.005834 0.311097 -0.064935 -0.253107
polarizability: 1.03895468e+02 -1.64251023e+00 6.37275966e+01 5.31250529e+00 1.31810338e+00 4.66307399e+01
1716.lowfreq: -8.6865 -0.0006 -0.0006 0.0004 5.3856 6.6071 40.7768 100.3193 119.2556
frequency: 40.7609 100.2999 119.2480 153.8257 214.5888 280.5271 303.7756 438.2030 451.5574 554.5295 571.3380 728.9359 806.3013 896.7450 909.9364 989.9539 1033.7005 1047.2301 1067.8170 1127.0702 1204.1327 1250.5757 1301.9922 1360.0835 1390.8263 1399.6382 1459.6605 1465.1778 1475.2169 1475.6456 1484.4904 1651.4672 2161.6375 2971.3617 2984.7560 2988.4364 3049.0552 3066.2438 3083.5004 3089.6314 3100.0834 3111.2189
redmass: 2.2855 1.3530 2.0216 2.6388 1.3853 3.2858 2.6885 2.8212 3.3136 3.9482 5.9282 2.0183 1.5221 1.4706 1.7386 1.7657 2.0981 1.4287 1.6962 2.3025 2.5420 1.2310 1.4248 1.4321 1.2060 1.2304 1.0732 1.0463 1.0449 1.0649 1.0662 6.7020 12.6334 1.0656 1.0352 1.0376 1.0936 1.0982 1.0994 1.1007 1.0912 1.0976
irintensity: 0.4748 0.2531 1.4894 1.9995 0.3136 0.3412 0.0965 0.4016 3.2650 6.3582 2.3035 8.5827 3.7311 18.4697 9.1292 13.2581 18.8618 0.7201 4.0900 1.9950 5.0529 0.8435 0.2516 1.6804 9.4953 17.9069 6.6334 14.5086 11.9868 7.7791 15.6255 13.9202 32.4809 22.9002 36.7730 15.2381 6.9867 14.3391 36.3397 37.1100 22.4315 23.7110
temp: 298.150 k
press: 1.00000 atm
elementType: 7 6 6 6 6 6 6 1 1 1 1 1 1 1 1 1
symmnumber: 1
zpe: 349077.3 jmol-1
zpe.correction: 0.132957 hartree
zpe.thermalcorrener: 0.141544 hartree
zpe.thermalcorrenthalpy: 0.142488 hartree
zpe.thermalcorrgfe: 0.099225 hartree
zpe.sumelectzpe: -288.219675 hartree
zpe.sumelectthermal: -288.211088 hartree
zpe.sumelectthermalent: -288.210144 hartree
zpe.sumelectthermalfe: -288.253406 hartree
dipole: -4.2743 2.1293 -0.3177
dipole: 4.7859
quadrupole: -53.1370 -42.0751 -43.2919
quadrupole: 6.8611 0.1933 0.9327
quadrupole: -6.9690 4.0929 2.8761 6.8611 0.1933 0.9327
hfenergy: -288.3526315 hartree
pointgroup: C01 [X(C6H9N1)]
dipole: 1.7642373 -0.600805 -0.2680779 debye
dipolederiv: -0.4678619 0.0119233 0.0175896 0.0875896 -0.2271292 -0.0026269 0.0362867 0.0011466 -0.2623304 -0.1421727 -0.0084616 -0.0112221 -0.1171728 0.092341 -0.0283872 -0.0171342 -0.0463987 0.0858916 0.3764773 0.0452901 -0.0562857 0.0491061 -0.0018312 -0.0072491 -0.1334007 -0.0036867 -0.1928781 0.0026809 -0.0187243 -0.0368373 0.0862 0.0980935 -0.0191992 0.0688197 -0.0027768 0.0402646 -0.2094904 -0.0101177 -0.0006954 0.0021772 0.3736399 0.0469645 0.0401688 0.0485557 0.01105 -0.0570255 -0.0171662 0.0149213 -0.0562798 -0.1021569 -0.0190197 0.0043011 -0.0264889 0.0897571 0.417795 -0.0516233 -0.0476883 -0.1419767 -0.1379476 -0.0053882 -0.0609866 -0.0071933 0.0323566 0.049119 -0.0008414 -0.0169691 0.0527528 -0.15591 -0.0620289 -0.0293344 -0.0338107 0.0661571 -0.0284534 -0.0391788 0.0547326 0.0066046 0.0647131 0.0969056 0.0597629 0.0732857 -0.0937385 0.0406529 0.0151437 0.015468 0.0555593 -0.089765 -0.0328158 0.0357683 -0.0349009 0.1475978 0.0850702 -0.0408717 0.0625662 -0.029856 0.0420832 0.0961474 0.0009688 0.0685509 -0.1081806 -0.2247735 0.023836 0.0128851 0.0421591 0.0851943 -0.023152 0.0127318 -0.0280225 0.0698558 0.1025335 0.0513272 -0.0099717 -0.0071409 -0.1626868 -0.0501538 -0.0164278 -0.013952 0.0703623 0.0584777 -0.034697 -0.1071571 -0.0420276 0.0426575 -0.0254627 -0.1007949 -0.0749885 -0.0261558 0.0901498 -0.040956 0.0792952 -0.0526589 0.0214086 0.0434562 0.0723063 0.0964397 -0.0303685 -0.093179 0.1151179 0.0293687 0.064964 0.0572954 -0.0079902 0.0269643 -0.0157596 0.1003588 unknown
polarizability: 103.8912148|3.8207664|63.6158423|-3.575789|2.7229863|46.7467476 unknown
InChI: InChI=1S/C6H9N/c1-3-4-6(2)5-7/h4H,3H2,1-2H3
charge 0 multiplicity 1
16 atoms
N  -2.870128 0.655946 0.321642
C  2.060315 0.114402 -0.389395
C  0.614116 0.484137 -0.164899
C  2.969697 0.614031 0.765827
C  -0.467106 -0.357625 -0.108372
C  -0.448022 -1.869486 -0.275836
C  -1.773366 0.21553 0.127985
H  2.186409 -0.97477 -0.519369
H  2.401223 0.586501 -1.334421
H  0.424104 1.558402 -0.020248
H  2.689342 0.139799 1.722869
H  4.028253 0.375706 0.557993
H  2.886048 1.708963 0.892638
H  -1.045654 -2.171966 -1.155527
H  -0.894146 -2.365214 0.605629
H  0.575114 -2.254455 -0.407516
