program: Gaussian 09
title: 000035894
version: EM64L-G09RevD.01
frameworkgroup: C1[X(C16H24N2O2)]
method: RPBEPBE
basis: SDD
operation: Freq
keyword: #p
keyword: freq=noraman
keyword: PBEPBE/SDD
title: #p freq=noraman PBEPBE/SDD
converged: YES YES NO NO
title: Mulliken charges:
elementType: O O N N C C C C C C C C C C C C C C C C H H H H H H H H H H H H H H H H H H H H H H H H
charge: -0.321577 -0.260440 -0.085711 -0.476568 -0.036369 -0.392399 -0.486932 -0.373957 -0.322759 -0.373358 -0.686524 0.241737 0.131828 0.363111 0.340035 -0.410511 -0.419646 -0.829426 -0.833246 -0.232787 0.269649 0.237310 0.203049 0.225927 0.229938 0.187868 0.232298 0.168320 0.204524 0.213467 0.212544 0.208048 0.207783 0.219625 0.325203 0.232487 0.232437 0.218073 0.220879 0.284766 0.235788 0.245616 0.224283 0.225616
chargesum: 0.00000
title: Mulliken charges with hydrogens summed into heavy atoms:
elementType: O O N N C C C C C C C C C C C C C C C C
charge: -0.321577 -0.260440 -0.085711 -0.151364 0.233279 0.047961 -0.031067 0.046209 0.050084 0.052653 -0.051068 0.241737 0.131828 0.363111 0.340035 -0.178025 -0.187208 -0.105708 -0.127559 -0.007171
polarizability: 2.51561936e+02 3.86597521e+00 1.99426058e+02 -2.35563769e+00 1.06210644e+01 1.31293571e+02
1716.lowfreq: -4.8682 -0.0008 -0.0006 -0.0005 4.6841 7.3221 11.4397 19.5401 40.3651
frequency: 10.4643 19.3242 40.3496 50.2245 66.6324 79.9130 88.2398 106.1802 124.3028 139.6604 157.8785 174.5394 190.2552 209.9274 222.8628 224.7299 237.2421 289.8144 305.5480 314.7479 317.2949 321.1482 370.5940 391.8487 436.7204 465.1280 513.9211 516.9117 536.2619 543.3008 591.1196 604.3990 653.3940 684.6266 691.4945 716.7466 751.1372 754.3814 777.8191 791.0706 816.8136 864.0232 878.9221 883.1339 897.8947 900.7103 921.0309 939.7830 946.8660 974.5767 983.8601 990.3280 1001.7391 1039.8812 1045.9016 1047.5212 1054.2943 1063.6408 1090.4620 1095.0796 1098.2941 1122.7838 1146.4706 1157.0433 1174.7591 1177.9214 1186.2527 1194.5280 1221.6479 1232.1261 1243.7819 1261.1572 1266.4848 1280.7953 1287.3686 1301.2324 1308.9612 1320.4224 1330.5150 1355.7189 1370.1488 1379.4132 1391.1487 1400.0217 1401.7645 1435.7684 1444.8913 1454.1390 1459.3036 1464.1902 1470.2478 1470.8840 1476.6209 1477.1598 1478.8221 1485.9885 1487.9291 1491.3956 1494.9855 1604.6951 1605.5006 1666.9560 2815.2682 2860.7458 2885.5468 2962.8819 2972.8449 2979.7252 2985.0370 3003.2887 3025.0394 3038.3323 3041.1290 3041.3488 3043.4079 3062.2222 3070.8869 3072.8485 3075.3412 3087.4393 3089.5892 3102.3954 3121.8064 3131.5230 3157.1231 3532.1941
redmass: 3.6527 4.0494 2.3727 3.7465 4.1753 2.6894 3.9928 3.0704 3.6495 3.3662 1.0665 1.9661 1.3827 1.4703 2.6383 2.6106 2.4287 3.4525 3.0698 3.0220 2.8056 2.7493 3.6965 2.8272 3.8579 2.9423 4.1154 3.1502 4.5283 3.1398 1.4215 2.8503 4.0191 4.2105 7.5059 4.3350 3.5660 1.1726 1.2248 3.5232 3.7032 4.2487 1.2968 1.9842 1.3118 1.9454 2.9388 2.4199 2.0502 1.3554 2.2886 1.9391 1.9898 1.6699 1.6576 2.9026 1.5957 1.8063 1.9371 2.3805 1.6970 1.9133 1.9422 2.9919 2.0431 1.1804 1.3259 1.4222 2.3050 3.0177 1.3313 1.6713 1.4305 2.5014 1.2020 1.2307 1.3786 1.2644 1.4501 1.4820 6.0100 1.4545 1.2392 1.2643 1.2410 1.9375 1.1032 1.7722 1.1294 1.0828 1.1018 1.0805 1.0547 1.0453 1.3946 1.0882 1.3199 1.1012 1.6322 6.1384 6.3722 8.7236 1.0707 1.0709 1.0712 1.0419 1.0357 1.0365 1.0622 1.0846 1.0669 1.0976 1.0923 1.0866 1.0902 1.0970 1.1013 1.0897 1.0988 1.0998 1.0982 1.1031 1.0856 1.0919 1.0995 1.0755
irintensity: 0.1222 0.0930 1.1232 0.2008 0.3239 0.1785 2.7780 2.1452 1.9184 3.9745 0.6832 1.7101 0.9892 0.7389 2.9798 2.8788 5.5575 2.0687 6.0801 8.1476 4.5020 4.7775 0.7793 1.4796 10.7969 3.9190 0.1832 0.9752 1.2223 13.9868 68.0960 1.8426 3.6290 1.4378 16.7772 25.4395 7.9887 2.7472 54.2605 9.0275 2.9168 2.2167 10.0253 17.1705 0.2039 3.3966 20.4661 0.2119 5.0455 4.0366 174.6314 16.0982 99.7245 6.0722 5.0039 3.0518 13.4801 36.0035 1.2791 36.7799 0.6843 8.4072 26.7829 424.7687 10.5928 7.6837 7.2483 8.9188 23.3985 22.8691 0.5682 7.0208 9.7253 10.7612 5.9158 6.3320 0.3954 2.5704 19.8963 14.4268 24.6897 2.8507 19.1706 20.6602 13.2589 41.1909 16.0259 45.1518 30.1335 6.2832 9.2191 9.5457 4.1447 16.7512 162.5287 3.4654 42.6077 19.4515 207.7534 7.8501 5.2887 214.3430 83.9122 98.4164 102.6290 33.2784 42.0818 23.2194 15.8852 35.2292 14.3906 8.3295 21.2323 62.2028 11.6386 11.7076 95.0156 23.2451 49.6963 20.2612 22.3432 25.8060 0.0981 25.6937 33.8689 26.2746
temp: 298.150 k
press: 1.00000 atm
elementType: 8 8 7 7 6 6 6 6 6 6 6 6 6 6 6 6 6 6 6 6 1 1 1 1 1 1 1 1 1 1 1 1 1 1 1 1 1 1 1 1 1 1 1 1
symmnumber: 1
zpe: 981875.8 jmol-1
zpe.correction: 0.373977 hartree
zpe.thermalcorrener: 0.395114 hartree
zpe.thermalcorrenthalpy: 0.396058 hartree
zpe.thermalcorrgfe: 0.321350 hartree
zpe.sumelectzpe: -882.529159 hartree
zpe.sumelectthermal: -882.508021 hartree
zpe.sumelectthermalent: -882.507077 hartree
zpe.sumelectthermalfe: -882.581785 hartree
dipole: 0.1082 -1.1671 -2.4227
dipole: 2.6914
quadrupole: -112.0119 -111.6440 -126.2522
quadrupole: -2.1909 -1.1962 1.5137
quadrupole: 4.6241 4.9920 -9.6162 -2.1909 -1.1962 1.5137
hfenergy: -882.9031353 hartree
pointgroup: C01 [X(C16H24N2O2)]
dipole: 0.0046912 0.4526822 0.9572164 debye
polarizability: 251.8131527|-0.4650467|198.9512407|2.5418499|11.3398556|131.5171712 unknown
InChI: InChI=1S/C16H24N2O2/c1-4-9-18-10-8-14(11-18)20-16(19)17-15-12(2)6-5-7-13(15)3/h5-7,14,17H,4,8-11H2,1-3H3
charge 0 multiplicity 1
44 atoms
O  -0.669754 1.270456 -0.029738
O  0.425353 -0.064592 -1.639637
N  -3.973513 0.330883 -0.140517
N  1.458564 0.616155 0.382946
C  -1.883922 1.28227 -0.906619
C  -2.674427 -0.048602 -0.764756
C  -2.817212 2.371482 -0.339669
C  -3.735543 1.586139 0.618594
C  -4.646607 -0.743896 0.612379
C  -5.093662 -1.916004 -0.286169
C  -5.847129 -3.00212 0.510954
C  0.42527 0.535504 -0.536547
C  2.771401 0.05127 0.228624
C  2.944336 -1.344735 -0.001929
C  3.888203 0.928608 0.371899
C  4.268457 -1.836245 -0.126434
C  5.191187 0.390546 0.261064
C  1.770298 -2.297969 -0.087038
C  3.682986 2.411874 0.626422
C  5.384458 -0.983797 0.001623
H  -1.542559 1.464728 -1.938135
H  -2.827649 -0.542074 -1.739523
H  -2.085585 -0.746598 -0.120776
H  -3.417394 2.799493 -1.161459
H  -2.246403 3.178263 0.147627
H  -3.214416 1.408922 1.593513
H  -4.690721 2.100445 0.826047
H  -3.988942 -1.144155 1.431267
H  -5.540047 -0.308187 1.102105
H  -5.736072 -1.513856 -1.092673
H  -4.209391 -2.367275 -0.777437
H  -5.213994 -3.41565 1.318916
H  -6.762386 -2.591569 0.97811
H  -6.149755 -3.840379 -0.14235
H  1.295977 1.261707 1.159138
H  4.417275 -2.906893 -0.309169
H  6.05509 1.057356 0.364816
H  2.10487 -3.341822 0.037361
H  1.01717 -2.077911 0.692515
H  1.256623 -2.202172 -1.060681
H  4.639151 2.956358 0.553568
H  2.979543 2.853464 -0.10357
H  3.272563 2.612171 1.637222
H  6.398307 -1.388189 -0.092185
