program: Gaussian 09
title: 000035834
version: EM64L-G09RevD.01
frameworkgroup: C1[X(C9H13NO2)]
method: RPBEPBE
basis: SDD
operation: Freq
keyword: #p
keyword: freq=noraman
keyword: PBEPBE/SDD
title: #p freq=noraman PBEPBE/SDD
converged: YES YES NO YES
title: Mulliken charges:
elementType: O O N C C C C C C C C C H H H H H H H H H H H H H
charge: -0.274631 -0.245593 -0.084811 -0.305086 -0.458797 -0.458817 -0.455847 -0.455831 0.328051 -0.308801 0.093966 -0.498888 0.274802 0.239060 0.216117 0.216120 0.239064 0.224734 0.251250 0.251245 0.224734 0.274356 0.232310 0.240649 0.240645
chargesum: 0.00000
title: Mulliken charges with hydrogens summed into heavy atoms:
elementType: O O N C C C C C C C C C
charge: -0.274631 -0.245593 -0.084811 -0.030284 -0.003620 -0.003634 0.020137 0.020148 0.328051 -0.034445 0.093966 0.214716
polarizability: 1.30537993e+02 2.73384934e+00 1.00516714e+02 5.46017091e-04 4.70919159e-04 8.31548423e+01
1716.lowfreq: -0.0011 -0.0005 -0.0005 9.7255 15.4019 21.2161 46.7615 78.1453 95.7740
frequency: 46.2967 78.0639 95.7673 139.2068 140.1374 171.6409 265.6134 294.4390 310.1182 328.0189 418.9747 453.2084 470.1074 608.8638 621.4296 645.2944 722.8705 731.5877 785.1167 799.0716 820.8520 840.7458 869.2357 894.7127 911.2052 963.2584 972.3410 993.5225 1024.8641 1037.0579 1052.7818 1065.3856 1112.3299 1123.2821 1147.1596 1172.3923 1191.9848 1198.6977 1231.4734 1231.7681 1258.3259 1281.9607 1299.2547 1303.2168 1316.7453 1326.7516 1368.0479 1423.5487 1451.0962 1458.1723 1464.0814 1466.9017 1467.6987 1480.1767 1583.6810 1630.5827 2993.5828 2993.9496 3001.8113 3015.0908 3016.1641 3053.1567 3056.0334 3077.5056 3082.3809 3088.1617 3102.2185 3145.5616 3157.1873
redmass: 3.9220 2.2026 1.4392 3.7923 1.9155 3.3098 2.9637 2.8447 3.0185 2.4163 2.5934 5.9299 5.4628 7.8931 3.2909 5.1365 4.8558 5.9416 2.8224 1.2825 2.7002 1.9632 2.9918 2.1247 4.5094 2.0227 3.7362 3.5444 3.1647 3.3074 4.0009 2.0257 1.2623 1.5465 1.4633 1.2601 1.3068 1.4021 1.1322 2.1123 1.3524 1.4347 1.4175 1.2534 1.2923 1.3131 2.3714 1.2149 1.0502 1.0776 1.0516 1.0830 1.0845 1.0918 7.9119 8.8691 1.0598 1.0602 1.0296 1.0609 1.0621 1.1038 1.1039 1.0882 1.1059 1.1062 1.1044 1.1046 1.0959
irintensity: 1.4931 1.6900 0.0069 2.7025 1.0680 6.2145 8.7600 0.3710 15.9425 5.6580 0.1775 0.7341 2.0631 7.7510 0.0008 0.9330 23.8947 18.8652 4.6338 6.0936 7.1630 19.6795 1.8544 23.1082 0.5081 3.0532 12.4402 2.4161 4.3313 84.3228 156.5291 1.5803 0.0442 12.5273 37.9093 0.0218 17.0631 6.1754 0.7124 159.8707 18.0983 20.4890 12.0991 1.4567 6.6453 2.1788 13.7464 24.4379 13.6706 0.1401 10.7975 13.8342 10.3128 4.8180 69.2021 198.0272 55.9242 12.6562 41.8298 57.1973 67.0419 6.5006 9.6114 12.6152 35.7788 46.7005 28.3233 16.3906 10.1005
temp: 298.150 k
press: 1.00000 atm
elementType: 8 8 7 6 6 6 6 6 6 6 6 6 1 1 1 1 1 1 1 1 1 1 1 1 1
symmnumber: 1
zpe: 546358.0 jmol-1
zpe.correction: 0.208097 hartree
zpe.thermalcorrener: 0.219340 hartree
zpe.thermalcorrenthalpy: 0.220284 hartree
zpe.thermalcorrgfe: 0.170525 hartree
zpe.sumelectzpe: -554.994113 hartree
zpe.sumelectthermal: -554.982870 hartree
zpe.sumelectthermalent: -554.981926 hartree
zpe.sumelectthermalfe: -555.031684 hartree
dipole: -0.4084 -0.3089 0.0000
dipole: 0.5121
quadrupole: -61.0550 -78.6891 -68.6310
quadrupole: -9.3727 -0.0001 0.0001
quadrupole: 8.4034 -9.2307 0.8274 -9.3727 -0.0001 0.0001
hfenergy: -555.2022095 hartree
pointgroup: C01 [X(C9H13N1O2)]
dipole: -0.1633294 0.1179484 0.0000823 debye
dipolederiv: -1.3372331 -0.3200361 -0.0004325 -0.6814581 -0.7285154 -0.0004961 -0.0006502 -0.0003839 -0.2856483 -0.7730899 0.2595319 0.0001278 0.0161697 -0.9070749 -0.0004585 -0.0000511 -0.0005135 -0.3185449 -0.6226738 -0.0497945 -0.0001019 -0.0643384 -0.50321 -0.0001083 -0.0000479 -0.0001035 -0.4192917 -0.0213955 -0.0643146 -0.0000779 0.0564721 0.0957004 0.0000208 0.0000038 0.0000121 0.0773539 0.0594697 0.0749668 0.0642748 0.0365533 -0.0755278 0.032987 0.0557332 -0.0533723 0.0018746 0.0595167 0.0750814 -0.0641105 0.0366801 -0.0755569 -0.0331163 -0.0556217 0.0532576 0.0018621 0.1603242 0.0216947 -0.0804131 0.0381604 0.2419894 -0.0405169 -0.1906554 0.0015968 0.3296683 0.1602484 0.0215344 0.0804056 0.0377847 0.241916 0.0403712 0.1906412 -0.0017534 0.329841 -0.5774888 0.1844964 0.0001057 0.4875656 -0.0982053 0.0001127 0.000349 0.000034 -0.1100993 0.6880112 0.0479197 0.0002158 -0.1738669 0.2337523 0.0003612 -0.000029 0.0004316 -0.1860795 1.7981844 -0.1191064 0.0001504 0.4698554 1.2916314 0.0009283 0.0006297 0.0008637 0.2409657 0.7149173 0.1006913 0.0001452 0.0337184 0.2294714 -0.0000348 0.0000838 -0.0000277 0.2794187 0.0702152 0.0992549 0.0000975 0.0463777 -0.0384254 -0.0000729 0.0000498 -0.0000636 0.0515135 0.0286664 0.0545576 -0.1177306 0.0118234 0.0404647 0.0297361 -0.072118 0.047283 -0.1201173 -0.0860727 -0.1469246 0.0284531 -0.1106206 -0.0640791 0.0285772 -0.0010099 -0.0095852 0.0722385 -0.0860536 -0.1468803 -0.0288146 -0.1106165 -0.0640573 -0.0289026 0.0007097 0.0092467 0.0721876 0.0285681 0.0543497 0.1179051 0.011697 0.0406174 -0.0294002 0.0722193 -0.046935 -0.1201672 -0.1918816 0.0395596 0.0415486 -0.0379442 0.0608548 0.0217286 0.000918 0.0027264 0.0735113 0.089299 -0.0389682 -0.075261 0.0077664 -0.0144977 -0.0822963 -0.0198385 -0.0743451 -0.1065319 0.0892735 -0.0391182 0.0752353 0.0077153 -0.0147939 0.0824844 0.0198923 0.0745138 -0.1062213 -0.1918639 0.0396217 -0.0415468 -0.0379477 0.0608971 -0.0217689 -0.0010573 -0.0027393 0.0734503 0.0029858 -0.0524717 -0.0000856 -0.1145087 0.0087562 -0.0001753 -0.0001621 -0.0001633 0.1687466 0.0115913 -0.0569655 -0.0000626 -0.12377 -0.0797951 -0.00018 -0.0001156 -0.0001696 0.1190483 -0.0367681 -0.0193461 0.0167129 0.0783219 0.0589829 -0.0997132 0.0677352 -0.0703736 -0.0596141 -0.0367504 -0.019334 -0.0167406 0.0784097 0.0587048 0.0999325 -0.067608 0.0705633 -0.059365 unknown
polarizability: 130.6442702|-2.0668929|100.4104214|0.0055471|0.0153771|83.1548571 unknown
InChI: InChI=1S/C9H13NO2/c1-12-9(11)8-6-10-4-2-7(8)3-5-10/h6-7H,2-5H2,1H3
charge 0 multiplicity 1
25 atoms
O  2.479186 0.86591 0.000764
O  2.19572 -1.451084 -0.001289
N  -1.773832 1.282847 0.000471
C  -0.781362 -1.119469 -0.001571
C  -1.690114 -0.93402 1.258197
C  -1.689544 -0.931659 -1.261403
C  -2.259299 0.52887 1.224554
C  -2.258851 0.531121 -1.225168
C  0.246774 0.002062 -0.000329
C  -0.312658 1.250704 0.00073
C  1.694089 -0.296465 -0.00026
C  3.942533 0.641265 0.000775
H  -0.291615 -2.105826 -0.002389
H  -1.105176 -1.113263 2.177767
H  -2.504829 -1.681803 1.227735
H  -2.504231 -1.679548 -1.232809
H  -1.104148 -1.10906 -2.18104
H  -3.363418 0.53723 1.189282
H  -1.946726 1.102823 2.112717
H  -1.946077 1.106773 -2.11216
H  -3.362981 0.539322 -1.190202
H  0.241104 2.19438 0.001756
H  4.380771 1.649241 0.001656
H  4.244764 0.076857 -0.897713
H  4.244519 0.075394 0.898427
