program: Gaussian 09
title: 000035822
version: EM64L-G09RevD.01
frameworkgroup: C1[X(C9H16O2)]
method: RPBEPBE
basis: SDD
operation: Freq
keyword: #pfreq=noraman
keyword: PBEPBE/SDD
title: #p freq=noraman PBEPBE/SDD
converged: NO YES NO NO
title: Mulliken charges:
elementType: O O C C C C C C C C C H H H H H H H H H H H H H H H H
charge: -0.418238 -0.230628 -0.362091 -0.364898 -0.456557 -0.487105 -0.187630 -0.179678 -0.436384 0.173549 -0.670293 0.192002 0.207825 0.217421 0.215536 0.199018 0.206983 0.251334 0.253251 0.224027 0.220480 0.206484 0.203723 0.215089 0.221157 0.210517 0.375106
chargesum: 0.00000
title: Mulliken charges with hydrogens summed into heavy atoms:
elementType: O O C C C C C C C C C
charge: -0.043132 -0.230628 0.037735 0.068060 -0.050556 0.017480 0.036397 0.040802 -0.026178 0.173549 -0.023530
polarizability: 1.45445434e+02 -4.26375696e+00 8.93555845e+01 5.39317358e+00 3.47644484e+00 8.33417186e+01
1716.lowfreq: -11.2325 -0.0007 -0.0003 0.0004 4.0037 6.5542 10.7413 28.9114 48.8895
frequency: 8.4712 28.7921 48.7515 67.8490 91.0378 107.7785 129.7433 138.2789 198.5703 224.5325 245.1449 287.7495 400.3442 418.3964 452.9049 500.0682 525.9501 587.6304 636.7641 727.5520 771.2863 775.5081 813.1442 856.9562 877.9339 913.6726 970.1590 989.2280 1018.4804 1028.0463 1043.1017 1066.1073 1070.7878 1090.5394 1107.9259 1120.9478 1170.9687 1221.3423 1229.8736 1244.5460 1254.1315 1276.5171 1284.8539 1288.6986 1297.2352 1309.3270 1335.6273 1350.2404 1371.5795 1384.3316 1436.3331 1459.8787 1463.4401 1467.2297 1475.0510 1483.0378 1483.9580 1672.0563 1685.9748 2952.4216 2963.7030 2963.9579 2976.5135 2986.9984 2995.8607 3004.7131 3023.7720 3025.2706 3035.5386 3059.8889 3063.3325 3068.8589 3074.1426 3081.9072 3512.7077
redmass: 6.0357 3.7095 2.7377 2.6566 2.1703 2.4269 2.9920 1.9959 1.5984 1.9255 4.2139 2.5821 2.4786 3.5539 3.3204 1.7786 2.6852 4.5715 1.3173 1.1120 1.2474 1.3217 1.6681 4.3269 1.6690 1.5357 1.1627 2.3609 2.8331 3.1496 1.6021 1.9104 2.4020 2.5141 2.2978 1.4813 1.8881 1.3003 1.3367 1.2412 1.3905 1.2120 1.1438 1.1855 1.2094 1.4660 1.4702 1.5510 1.8398 1.2027 1.0849 1.0829 1.0746 1.0815 1.0428 1.0990 1.0642 8.2844 6.5874 1.0615 1.0617 1.0608 1.0355 1.0614 1.0604 1.0950 1.0973 1.0990 1.1004 1.0950 1.1015 1.0928 1.0955 1.1005 1.0639
irintensity: 0.8013 0.0343 0.2371 0.4459 0.2467 0.0343 1.2852 0.4822 0.4622 1.6970 0.3637 0.8043 2.2271 13.3809 12.4608 28.9145 11.5783 13.0368 128.6496 15.3858 3.9221 3.2580 2.9101 1.3490 3.3773 12.2324 35.2356 76.5867 136.3165 16.8292 16.1271 1.7671 52.2002 38.3474 5.0150 0.5667 2.3813 10.6998 1.9568 0.5306 4.9494 3.3614 8.3693 10.0927 0.5126 11.5492 14.6851 6.1409 32.0126 9.9330 29.1712 1.6484 7.1852 0.4569 11.5817 19.2327 12.3048 212.2879 0.0637 20.5185 44.5262 34.4839 39.9033 5.1280 35.7017 6.3079 15.0537 6.0276 7.7083 2.9347 47.4397 23.4548 119.9701 59.6850 17.8095
temp: 298.150 k
press: 1.00000 atm
elementType: 8 8 6 6 6 6 6 6 6 6 6 1 1 1 1 1 1 1 1 1 1 1 1 1 1 1 1
symmnumber: 1
zpe: 608755.4 jmol-1
zpe.correction: 0.231863 hartree
zpe.thermalcorrener: 0.245610 hartree
zpe.thermalcorrenthalpy: 0.246555 hartree
zpe.thermalcorrgfe: 0.187843 hartree
zpe.sumelectzpe: -502.107922 hartree
zpe.sumelectthermal: -502.094175 hartree
zpe.sumelectthermalent: -502.093230 hartree
zpe.sumelectthermalfe: -502.151942 hartree
dipole: -0.6875 1.3209 0.5719
dipole: 1.5951
quadrupole: -64.3068 -73.8103 -66.5381
quadrupole: 5.0184 2.2262 -1.8149
quadrupole: 3.9116 -5.5919 1.6803 5.0184 2.2262 -1.8149
hfenergy: -502.339785 hartree
pointgroup: C01 [X(C9H16O2)]
dipole: -0.2621176 -0.516286 -0.2420707 debye
polarizability: 145.1682655|5.5901004|89.2891681|-5.7493382|3.5440765|83.6853036 unknown
InChI: InChI=1S/C9H16O2/c1-2-3-4-5-6-7-8-9(10)11/h3-4,10H,2,5-8H2,1H3
charge 0 multiplicity 1
27 atoms
O  4.936669 -1.10913 -0.211757
O  4.309186 0.973506 0.599121
C  0.090251 -0.036353 -0.373567
C  1.494934 0.452988 0.04149
C  -1.021811 0.989211 -0.026282
C  2.589631 -0.57572 -0.299306
C  -2.394063 0.554904 -0.49857
C  -3.474249 0.355091 0.301477
C  -4.845098 -0.086496 -0.169712
C  3.982607 -0.118111 0.086288
C  -5.30298 -1.41299 0.490882
H  0.072779 -0.23654 -1.465284
H  -0.139791 -0.99945 0.125177
H  1.513905 0.665085 1.127734
H  1.722362 1.413036 -0.460513
H  -0.755823 1.960856 -0.495017
H  -1.038343 1.160254 1.068148
H  2.598131 -0.801577 -1.384121
H  2.398788 -1.544161 0.203098
H  -2.501339 0.388799 -1.583526
H  -3.366794 0.515009 1.387386
H  -4.842668 -0.198351 -1.271112
H  -5.589719 0.701703 0.067971
H  -6.319943 -1.692461 0.158818
H  -4.615289 -2.238078 0.231954
H  -5.319994 -1.321057 1.593118
H  5.83946 -0.779266 0.048605
