program: Gaussian 09
title: 000035833
version: EM64L-G09RevD.01
frameworkgroup: C1[X(C12H16NO2)]
method: RPBEPBE
basis: SDD
operation: Freq
keyword: #p
keyword: freq=noraman
keyword: PBEPBE/SDD
title: #p freq=noraman PBEPBE/SDD
converged: YES YES NO NO
title: Mulliken charges:
elementType: O O N C C C C C C C C C C C C H H H H H H H H H H H H H H H H
charge: -0.312445 -0.140657 -0.221713 0.366444 0.167086 0.145246 -0.574924 -0.574264 -0.594063 -0.150489 -0.311010 0.066542 -0.335205 -0.245393 -0.661024 0.312298 0.272147 0.256547 0.311493 0.256501 0.272754 0.267643 0.275872 0.276234 0.288522 0.268017 0.299621 0.266860 0.232375 0.249167 0.269819
chargesum: 1.00000
title: Mulliken charges with hydrogens summed into heavy atoms:
elementType: O O N C C C C C C C C C C C C
charge: -0.312445 -0.140657 -0.221713 0.366444 0.167086 0.145246 0.266068 0.266484 0.225686 0.138033 -0.042994 0.066542 -0.035584 0.021466 0.090337
polarizability: 1.76410415e+02 3.93820129e+00 1.50052320e+02 -2.82604111e+00 -3.60947572e+00 8.47727332e+01
1716.lowfreq: -10.4258 -0.0007 -0.0006 -0.0003 7.0791 12.6490 59.1887 71.2685 95.4495
frequency: 59.1024 71.2336 95.4047 155.2748 168.5246 207.7927 210.5915 222.8972 249.7480 276.0713 281.6246 311.7373 334.3115 343.5945 348.3210 375.5204 411.6087 430.7049 504.0361 530.7195 540.7768 559.1966 570.1648 589.6325 646.8938 699.5954 750.8686 763.4407 795.1793 810.0751 832.5465 877.9661 907.3527 935.9879 937.2720 959.7648 998.4245 1024.1968 1053.1320 1062.6920 1069.9625 1110.6191 1116.7849 1117.4281 1151.2188 1178.2560 1215.0525 1217.1785 1224.2214 1259.7049 1263.4050 1273.6629 1283.5069 1391.6592 1396.8288 1420.5088 1422.8754 1430.8118 1450.7921 1455.8029 1461.9710 1469.3114 1473.0859 1474.4446 1478.9273 1483.9988 1492.2239 1510.1718 1598.7817 1613.7494 1654.3026 3003.7813 3026.7427 3028.5555 3032.7906 3044.2744 3104.5291 3116.6128 3144.1830 3145.4456 3150.6598 3154.8165 3158.7585 3161.7211 3163.9973 3174.9540 3189.5201
redmass: 3.4100 3.7521 4.1175 3.7369 3.8768 1.5285 1.1010 1.8039 3.2209 2.5772 1.3042 3.7487 3.0458 3.2632 1.0762 3.5175 2.6791 3.1095 4.2521 3.5476 5.0243 4.8110 4.3846 4.4560 8.1063 5.0006 3.0009 3.0007 4.0655 1.9247 4.7690 4.1858 2.8547 1.7329 2.1048 3.0561 1.3627 2.0379 1.1917 1.9079 1.8777 1.3964 1.3683 2.1318 2.7593 1.6170 1.6239 1.7866 1.7463 1.7670 1.8702 1.8845 1.5742 1.1932 6.3616 1.2665 1.1605 2.1310 1.0434 1.2269 1.0538 1.3987 1.1047 1.0510 1.4520 1.0669 1.0460 1.0548 7.7901 8.2340 12.2065 1.0356 1.0312 1.0316 1.0327 1.0857 1.0993 1.1023 1.1057 1.1055 1.1051 1.1056 1.1068 1.1064 1.0888 1.0927 1.0985
irintensity: 1.4357 0.6510 3.9919 1.2374 1.2890 0.5089 1.3579 1.9418 1.4560 2.7682 1.3856 3.7579 2.8841 3.5236 0.8509 12.0123 0.6004 1.9859 8.4504 0.9352 13.2114 3.4145 2.6312 1.9869 5.5201 4.2389 30.2859 32.9267 3.2767 24.6078 34.8312 27.8822 20.5491 25.2665 33.5258 12.3845 0.6752 46.7462 0.0229 7.3398 6.7482 10.4777 0.3728 8.1834 31.9649 22.8618 7.6140 0.0196 9.0258 12.5919 17.8468 10.9161 8.2273 25.6803 29.4114 46.7288 27.3591 51.3885 0.9830 20.3870 16.7188 25.3807 10.5248 0.5810 18.0134 30.7860 31.9072 71.7091 3.7304 107.2021 180.5597 4.8105 5.3067 11.7869 5.3947 2.6275 6.0345 11.2732 0.7839 0.0438 10.5767 2.1327 0.3377 3.7046 0.7764 0.3272 1.4056
temp: 298.150 k
press: 1.00000 atm
elementType: 8 8 7 6 6 6 6 6 6 6 6 6 6 6 6 1 1 1 1 1 1 1 1 1 1 1 1 1 1 1 1
symmnumber: 1
zpe: 681073.3 jmol-1
zpe.correction: 0.259407 hartree
zpe.thermalcorrener: 0.273779 hartree
zpe.thermalcorrenthalpy: 0.274723 hartree
zpe.thermalcorrgfe: 0.219356 hartree
zpe.sumelectzpe: -670.691673 hartree
zpe.sumelectthermal: -670.677300 hartree
zpe.sumelectthermalent: -670.676356 hartree
zpe.sumelectthermalfe: -670.731723 hartree
dipole: 9.5087 -2.1099 -0.2157
dipole: 9.7424
quadrupole: -57.9208 -66.0286 -81.8878
quadrupole: 2.9667 0.4143 -1.2319
quadrupole: 10.6916 2.5838 -13.2754 2.9667 0.4143 -1.2319
hfenergy: -670.9510798 hartree
pointgroup: C01 [X(C12H16N1O2)]
dipole: 3.7619073 0.726842 0.1057992 debye
polarizability: 176.1643351|-4.6848506|150.388508|2.8688182|-2.6190554|84.6826253 unknown
InChI: InChI=1S/C12H16NO2/c1-8-11(14)9-6-5-7-10(12(9)15-8)13(2,3)4/h5-8H,1-4H3
charge 1 multiplicity 1
31 atoms
O  -0.503175 1.382888 -0.232634
O  -3.636892 -0.485436 -0.238334
N  2.358989 0.586699 0.00153
C  1.2143 -0.413368 0.02556
C  -0.118325 0.046259 -0.093324
C  -1.202077 -0.861566 -0.076397
C  2.198002 1.577528 1.170099
C  2.337866 1.358489 -1.331917
C  3.724819 -0.08373 0.135976
C  -2.027949 1.411532 -0.338211
C  1.421965 -1.80509 0.163273
C  -2.45435 -0.075357 -0.220135
C  -0.995748 -2.247706 0.063889
C  0.331428 -2.712765 0.182842
C  -2.613951 2.316899 0.743316
H  1.235293 2.09525 1.061648
H  2.22593 1.010938 2.11251
H  3.028279 2.29965 1.131134
H  1.375933 1.881468 -1.420337
H  3.168773 2.080849 -1.328903
H  2.458948 0.636771 -2.153139
H  4.490748 0.705884 0.109668
H  3.783285 -0.617512 1.095576
H  3.882791 -0.775455 -0.704127
H  -2.241692 1.793743 -1.352734
H  2.42962 -2.217202 0.257836
H  -1.849744 -2.931819 0.076712
H  0.534925 -3.781527 0.290643
H  -2.338198 1.970583 1.753673
H  -2.281727 3.359526 0.612738
H  -3.714869 2.287276 0.659769
