program: Gaussian 09
title: 000035783
version: EM64L-G09RevD.01
frameworkgroup: C1[X(C17H34N2O2)]
method: RPBEPBE
basis: SDD
operation: Freq
keyword: #p
keyword: freq=noraman
keyword: PBEPBE/SDD
title: #p freq=noraman PBEPBE/SDD
converged: YES YES NO NO
title: Mulliken charges:
elementType: O O N N C C C C C C C C C C C C C C C C C H H H H H H H H H H H H H H H H H H H H H H H H H H H H H H H H H H
charge: -0.288313 -0.234397 -0.098526 -0.064125 0.239737 -0.401549 -0.346824 -0.357090 -0.384506 -0.376473 -0.321362 -0.386586 -0.378793 -0.451051 -0.763620 0.183325 -0.246159 -0.354147 -0.727425 -0.615085 -0.707374 0.193186 0.200809 0.189200 0.198180 0.210181 0.189387 0.185965 0.205301 0.205414 0.181661 0.217699 0.188425 0.198031 0.218675 0.212189 0.200378 0.218904 0.201554 0.202080 0.233319 0.231405 0.220300 0.247858 0.185801 0.197653 0.222865 0.213691 0.229355 0.222441 0.221839 0.188737 0.212748 0.221204 0.213909
chargesum: 0.00000
title: Mulliken charges with hydrogens summed into heavy atoms:
elementType: O O N N C C C C C C C C C C C C C C C C C
charge: -0.288313 -0.234397 -0.098526 -0.064125 0.239737 -0.007554 0.040556 0.042479 0.006759 0.010602 0.084762 0.030120 0.033775 -0.030593 -0.096817 0.183325 0.221999 0.029307 -0.061515 0.017932 -0.059513
polarizability: 2.30195908e+02 -3.87218400e+00 2.05221220e+02 -4.06676106e+00 9.54010918e-01 1.74095248e+02
1716.lowfreq: -7.4433 0.0004 0.0006 0.0008 5.8130 9.5956 18.8652 22.0593 40.2964
frequency: 18.2686 20.4434 40.1432 47.9573 57.2013 62.6683 69.4767 88.1512 92.1994 97.5838 110.2348 132.8479 158.1705 178.3706 201.0336 215.9031 221.7475 228.7130 238.3905 244.8967 255.5997 270.3195 285.9899 292.5706 294.4001 319.4565 327.6254 329.5767 347.4874 365.0240 400.7593 410.5585 435.3522 472.1664 487.5883 490.5316 527.8128 569.2325 596.4652 714.8721 726.2123 730.6453 755.2178 772.7384 779.7271 791.5592 801.5371 848.4171 858.4203 871.7806 897.4004 902.8229 918.4545 920.9396 930.5051 983.0531 1001.2927 1009.3528 1012.2954 1026.3776 1030.8102 1050.0945 1054.9995 1059.1364 1070.7380 1084.8427 1085.6446 1087.1025 1101.6168 1103.1699 1110.0983 1126.0982 1142.0597 1148.3429 1150.6748 1161.5373 1187.9190 1192.5696 1194.8668 1202.8309 1211.0624 1236.8910 1256.6788 1267.3071 1276.6890 1277.7906 1280.1405 1291.4280 1296.6808 1305.1395 1318.9926 1330.2068 1332.4869 1337.8078 1345.6289 1351.1551 1360.0153 1367.5688 1370.0428 1372.3822 1389.2595 1390.8745 1391.8587 1396.7452 1428.6353 1448.3211 1450.9838 1452.0740 1454.5076 1460.0715 1461.2130 1462.1916 1463.1153 1465.1330 1467.3573 1473.0575 1476.4783 1477.0682 1479.0800 1479.5696 1481.9068 1482.7228 1489.7606 1493.6637 1621.8680 2840.1355 2846.9657 2852.1180 2861.8655 2864.7883 2875.6255 2957.7680 2963.6981 2970.7266 2972.1642 2977.8660 2981.2175 2992.8519 2993.9529 2998.9893 3014.5196 3017.3132 3018.7309 3023.0500 3026.0975 3028.3795 3030.4708 3037.9526 3038.4403 3044.7429 3052.6828 3066.5931 3069.7824 3071.6568 3075.3825 3080.8050 3085.4238 3089.9157 3102.8965
redmass: 3.6438 4.3516 4.2894 3.1970 4.7198 3.5149 2.7697 1.6904 3.2683 2.6240 2.7841 2.3687 2.2342 3.1716 2.7298 1.1864 2.2466 1.3010 2.0977 1.0953 1.8477 1.5137 2.0241 2.8182 3.4977 2.4259 2.4427 2.1944 2.5435 3.0260 2.4152 2.1280 2.9740 2.9391 2.8440 2.8953 2.9899 3.4674 2.1376 2.7401 2.3200 1.2167 3.1336 2.2103 1.3365 1.8758 2.1901 1.5301 2.2771 2.4862 1.7610 2.3757 1.5393 2.0009 2.0714 2.0178 1.6243 1.7259 2.3462 2.1673 1.9983 1.6998 1.8864 2.1891 1.7576 1.6417 1.7470 2.1659 3.0931 2.5379 2.2039 1.7506 2.3749 2.7247 2.7641 2.2404 2.5369 1.4657 1.1634 1.8641 1.1838 1.4814 1.9195 1.3219 1.2423 1.2442 1.5557 1.4148 1.1025 1.2944 1.4176 1.4217 1.3394 1.3597 1.3483 1.3866 1.5120 1.4679 1.5218 1.4282 1.3466 1.2491 1.2519 1.1997 1.1727 1.0749 1.0810 1.0792 1.0871 1.0743 1.0699 1.0807 1.0780 1.0700 1.0606 1.0944 1.0669 1.0816 1.0580 1.0568 1.0541 1.0585 1.0774 1.0562 10.4562 1.0697 1.0665 1.0702 1.0651 1.0672 1.0672 1.0587 1.0606 1.0374 1.0590 1.0596 1.0377 1.0388 1.0606 1.0969 1.0594 1.0730 1.1006 1.0895 1.0896 1.0892 1.0881 1.0880 1.0997 1.1026 1.0981 1.1002 1.0996 1.0991 1.1010 1.1002 1.1071 1.0979 1.0984
irintensity: 0.1095 0.1424 0.4250 0.0206 0.0837 0.2699 0.2392 0.0196 0.3360 0.1800 0.2160 0.4463 3.8945 2.6398 2.5317 0.4617 0.6602 0.3542 4.0664 0.0608 0.4333 1.1854 1.4354 3.6001 2.5560 4.1168 0.7967 17.0920 5.0790 0.4387 6.0330 0.3831 0.1778 2.1495 0.6139 0.8197 0.3566 1.0801 0.7139 4.4754 14.1060 13.8402 12.8991 1.8879 7.3512 3.2306 1.7068 0.0140 8.4733 1.8877 7.4725 6.8144 1.2198 2.8296 31.8149 16.1080 12.7528 16.7785 30.6545 2.2801 12.8385 2.9934 0.8817 2.9702 2.5312 7.2164 31.1296 8.0428 197.1921 125.3556 10.5211 6.7424 11.7463 18.4376 72.4653 4.6281 7.3090 1.3165 1.2643 13.4190 7.8833 8.9050 1.1375 0.9007 4.1053 1.9530 15.9998 40.4202 1.2628 0.3359 0.2984 7.0550 6.7566 0.5120 6.4541 3.4969 1.1369 7.1551 0.4553 4.3453 8.3851 2.8617 15.7006 31.0023 1.6042 0.2890 5.4468 0.6345 2.9074 31.7583 3.9753 11.0782 8.2473 1.0119 7.4336 32.2048 4.1190 7.2408 4.3318 19.9453 7.2380 13.3907 8.4142 9.4328 160.0023 95.8922 33.0287 74.6489 29.7637 29.1963 375.2953 14.4635 1.1683 25.0376 49.5337 67.8326 23.7399 31.4307 20.5765 6.2394 27.7000 48.8552 4.0664 20.8826 74.8287 34.4813 55.5781 25.1771 0.1231 67.4622 54.3449 95.1741 49.6864 46.7762 33.8281 62.0170 23.2228 26.5611 28.2364
temp: 298.150 k
press: 1.00000 atm
elementType: 8 8 7 7 6 6 6 6 6 6 6 6 6 6 6 6 6 6 6 6 6 1 1 1 1 1 1 1 1 1 1 1 1 1 1 1 1 1 1 1 1 1 1 1 1 1 1 1 1 1 1 1 1 1 1
symmnumber: 1
zpe: 1287486.1 jmol-1
zpe.correction: 0.490378 hartree
zpe.thermalcorrener: 0.515572 hartree
zpe.thermalcorrenthalpy: 0.516516 hartree
zpe.thermalcorrgfe: 0.433981 hartree
zpe.sumelectzpe: -926.405614 hartree
zpe.sumelectthermal: -926.380419 hartree
zpe.sumelectthermalent: -926.379475 hartree
zpe.sumelectthermalfe: -926.462010 hartree
dipole: -0.9081 -0.1129 -1.9232
dipole: 2.1298
quadrupole: -129.2998 -123.9978 -139.0379
quadrupole: 2.9271 -9.6668 0.8393
quadrupole: 1.4787 6.7807 -8.2594 2.9271 -9.6668 0.8393
hfenergy: -926.8959914 hartree
pointgroup: C01 [X(C17H34N2O2)]
dipole: 0.3668194 0.0392 -0.7523669 debye
polarizability: 229.9459209|-4.3161968|205.3727062|4.6926927|-1.0262905|174.193749 unknown
InChI: InChI=1S/C17H34N2O2/c1-5-7-9-17(3,6-2)16(20)21-15-8-10-19-13-11-18(4)12-14-19/h5-15H2,1-4H3
charge 0 multiplicity 1
55 atoms
O  -1.501421 1.267885 -0.068522
O  -2.256115 0.734395 2.061589
N  2.117344 0.946124 -0.511301
N  4.615323 -0.316801 0.255613
C  -3.309452 -0.34589 0.071818
C  -2.480458 -1.384975 -0.759015
C  3.301117 1.752213 -0.122181
C  2.552089 -0.337449 -1.117711
C  4.187058 0.966671 0.858955
C  3.436761 -1.123558 -0.136458
C  1.159982 1.68379 -1.370981
C  -4.162981 0.502904 -0.932451
C  -1.426743 -2.193744 0.029988
C  0.349254 2.74765 -0.597042
C  -4.216089 -1.057359 1.103622
C  -2.335719 0.582249 0.820292
C  -0.468134 2.154776 0.549455
C  -0.674196 -3.209928 -0.860982
C  -4.994501 1.641434 -0.304633
C  5.548495 -1.063175 1.120021
C  0.404748 -3.99842 -0.088119
H  -3.203371 -2.0840 -1.229045
H  -1.971297 -0.844854 -1.581389
H  3.912328 2.03189 -1.017976
H  2.965999 2.685534 0.365737
H  1.653401 -0.934673 -1.361918
H  3.128379 -0.171022 -2.062935
H  3.613714 0.803628 1.808109
H  5.087546 1.562448 1.100671
H  3.788064 -2.054043 -0.621348
H  2.818687 -1.409474 0.754729
H  0.449016 0.947739 -1.79022
H  1.6741 2.174425 -2.236766
H  -4.837948 -0.198299 -1.463961
H  -3.479206 0.9309 -1.689517
H  -0.689199 -1.501521 0.485861
H  -1.904651 -2.739455 0.867429
H  -0.324974 3.266625 -1.304966
H  1.021957 3.519768 -0.175074
H  -4.932599 -1.715102 0.577152
H  -4.782511 -0.331461 1.710163
H  -3.626243 -1.668217 1.806793
H  -0.984309 2.928156 1.146577
H  0.163058 1.539751 1.214162
H  -0.204673 -2.673242 -1.711786
H  -1.403645 -3.91693 -1.307014
H  -5.747993 1.263175 0.409036
H  -5.533174 2.201041 -1.091333
H  -4.350078 2.361011 0.23364
H  5.887965 -1.976654 0.59918
H  6.436727 -0.441415 1.333461
H  5.097769 -1.369909 2.098382
H  -0.042706 -4.558325 0.754698
H  1.166999 -3.315442 0.333255
H  0.922507 -4.725644 -0.74054
