program: Gaussian 09
title: 000035892
version: EM64L-G09RevD.01
frameworkgroup: C1[X(C16H23ClN2O2)]
method: RPBEPBE
basis: SDD
operation: Freq
keyword: #p
keyword: freq=noraman
keyword: PBEPBE/SDD
title: #p freq=noraman PBEPBE/SDD
converged: YES YES NO NO
title: Mulliken charges:
elementType: Cl O O N N C C C C C C C C C C C C C C C C H H H H H H H H H H H H H H H H H H H H H H H
charge: -0.065172 -0.311023 -0.257065 -0.137595 -0.469106 0.324334 -0.375751 -0.064535 -0.366611 -0.492120 -0.733953 -0.718698 -0.703570 0.245883 0.417990 0.369793 -0.304853 -0.399084 -0.820617 -0.246311 -0.227528 0.226229 0.216686 0.268890 0.189324 0.230904 0.220828 0.235753 0.219850 0.207830 0.227417 0.225317 0.225873 0.206455 0.213723 0.212676 0.212019 0.330600 0.236765 0.219061 0.289535 0.228030 0.257546 0.234281
chargesum: 0.00000
title: Mulliken charges with hydrogens summed into heavy atoms:
elementType: Cl O O N N C C C C C C C C C C C C C C C C
charge: -0.065172 -0.311023 -0.257065 -0.137595 -0.138506 0.324334 0.067164 0.204355 0.053618 -0.035539 -0.078856 -0.061054 -0.065152 0.245883 0.417990 0.369793 -0.304853 -0.162319 -0.083990 0.011235 0.006753
polarizability: 2.53048025e+02 7.39653728e-01 2.06409125e+02 2.29778376e+01 -6.70458268e+00 1.47754957e+02
1716.lowfreq: -9.1947 -2.4570 -0.0021 -0.0014 0.0011 2.3847 10.5031 16.5756 32.3797
frequency: 7.7975 16.4043 32.2440 48.3825 62.2547 82.7306 101.8737 113.9828 154.2195 173.3625 186.2596 195.6823 205.6205 216.1616 235.7451 241.6007 250.1909 268.8208 275.0193 298.3340 313.3486 330.8750 340.1142 345.6877 370.7054 397.7533 425.6937 454.5278 462.9253 468.0237 510.1080 523.0961 541.6559 544.0301 603.7192 639.9564 651.7191 696.0746 716.2916 742.0044 765.3310 772.8119 786.0482 802.3456 826.2707 872.5112 882.9797 892.7305 895.6063 915.5556 933.7626 938.3862 943.1725 969.5293 986.3780 996.3919 1002.5382 1015.0838 1019.8752 1027.9972 1053.1349 1085.2727 1086.4625 1095.3257 1139.8612 1141.3186 1160.8030 1163.2797 1181.0916 1184.8737 1207.4189 1221.8786 1238.1829 1239.9327 1245.1321 1273.9157 1283.7571 1304.9239 1322.7179 1331.5341 1351.5676 1365.4574 1369.1720 1371.7949 1395.6652 1401.4289 1416.4991 1444.5671 1453.8930 1455.8088 1460.8029 1467.7840 1470.9712 1475.9668 1479.3093 1481.1035 1486.5528 1494.7796 1497.0754 1501.1412 1572.7473 1609.5008 1663.2260 2884.5938 2942.2058 2973.9869 2978.4506 2983.3966 2984.2335 3005.6506 3021.7129 3041.6201 3067.9335 3068.1737 3069.8447 3074.2083 3076.0099 3081.3074 3082.3986 3088.9935 3092.4269 3099.5451 3135.4991 3156.5332 3178.1130 3514.8553
redmass: 4.6695 5.3281 3.2738 4.6469 4.1106 6.8614 4.9558 3.3577 3.3355 1.3646 1.2459 4.2441 3.3831 2.4659 2.2843 1.2053 1.9161 2.3810 1.5977 4.7793 3.1956 2.3474 2.4282 2.6527 4.3359 3.6893 3.0954 2.8852 3.2821 3.1710 3.9535 4.1797 3.5707 2.8351 1.5088 5.6524 3.1972 4.4992 4.7844 4.2951 3.9928 1.2899 4.7259 3.0792 5.0981 2.0441 4.2717 1.7104 1.3719 1.5765 1.8200 1.2439 3.2182 1.3349 2.7249 1.6333 2.4329 1.4331 1.5589 2.1112 1.5320 1.7863 1.7797 1.7291 3.0086 3.0107 1.4269 1.8719 1.6541 1.4863 1.4319 2.4632 2.2116 2.6143 2.7985 1.8249 1.9941 1.3575 1.2994 1.4011 1.4620 6.7438 1.2371 1.2304 1.2095 1.2307 2.1494 1.0966 1.0536 1.0998 1.0505 2.7395 1.0517 1.0649 1.0591 1.1747 1.0764 1.1443 1.4266 1.2851 5.7689 6.8991 8.1254 1.0704 1.0656 1.0349 1.0348 1.0360 1.0363 1.0953 1.0649 1.0871 1.0970 1.0998 1.0995 1.0892 1.0993 1.0985 1.1004 1.0995 1.1000 1.1029 1.0875 1.0928 1.0984 1.0754
irintensity: 0.1277 0.1584 0.5381 1.0156 0.5236 2.0233 3.7366 0.3569 2.8033 0.1219 0.4177 2.8653 1.7119 1.0300 4.4552 0.8567 6.1665 3.9616 3.1563 6.8225 0.5926 0.2315 7.2797 3.6745 4.5397 5.5647 2.2646 6.1218 2.0206 3.6658 1.3228 1.1451 9.1893 0.1194 69.7590 15.3027 5.5658 6.1210 57.8030 2.9420 1.8047 61.0621 13.4618 2.5106 20.2801 17.8487 15.9766 3.8832 0.3962 1.3552 2.7551 0.5723 2.0003 1.2004 103.6524 7.3321 186.7566 0.5602 3.3936 22.3286 10.6375 2.6311 32.5392 2.6129 36.3089 35.3030 113.3515 322.2188 21.0724 51.6274 8.7551 17.4873 14.1734 72.9100 17.3064 21.0081 20.1949 3.7403 3.5771 10.0712 3.8676 58.9575 27.5418 26.1335 16.5964 23.8318 35.3670 16.8455 0.8483 35.0733 0.2511 10.5835 1.2619 5.9324 8.0520 34.4247 10.9620 70.9171 266.5857 153.5500 17.6005 17.3623 185.1314 76.0040 52.6076 30.5751 31.6434 13.7183 20.4780 34.3155 14.9328 56.5997 8.5355 16.5619 11.6175 30.3907 44.1479 79.1924 9.7054 65.5614 19.3457 24.3992 6.6160 14.7867 8.9206 38.4150
temp: 298.150 k
press: 1.00000 atm
elementType: 17 8 8 7 7 6 6 6 6 6 6 6 6 6 6 6 6 6 6 6 6 1 1 1 1 1 1 1 1 1 1 1 1 1 1 1 1 1 1 1 1 1 1 1
symmnumber: 1
zpe: 955455.1 jmol-1
zpe.correction: 0.363914 hartree
zpe.thermalcorrener: 0.385970 hartree
zpe.thermalcorrenthalpy: 0.386914 hartree
zpe.thermalcorrgfe: 0.310397 hartree
zpe.sumelectzpe: -1341.915982 hartree
zpe.sumelectthermal: -1341.893926 hartree
zpe.sumelectthermalent: -1341.892982 hartree
zpe.sumelectthermalfe: -1341.969498 hartree
dipole: 0.6954 -0.1345 -1.2203
dipole: 1.4109
quadrupole: -117.5179 -130.1283 -135.8025
quadrupole: -0.9009 3.5135 3.5957
quadrupole: 10.2983 -2.3120 -7.9863 -0.9009 3.5135 3.5957
hfenergy: -1342.2798954 hartree
pointgroup: C01[X(C16H23Cl1N2O2)]
dipole: 0.2646917 -0.1756517 -0.4552216 debye
polarizability: 253.9015593|8.0216442|198.8080585|19.406728|-20.8915692|154.502489 unknown
InChI: InChI=1S/C16H23ClN2O2/c1-11-6-5-7-13(17)14(11)18-15(20)21-12-8-9-19(10-12)16(2,3)4/h5-7,12,18H,8-10H2,1-4H3
charge 0 multiplicity 1
44 atoms
Cl 1.858389 2.37529 -1.755242
O  -0.613254 -1.302486 -0.594003
O  0.73047 -1.24014 1.344133
N  -3.69419 -0.374781 0.181526
N  1.469077 -0.445885 -0.767532
C  -4.214052 1.030324 0.220974
C  -2.462954 -0.670424 0.975038
C  -1.755233 -1.827562 0.227638
C  -3.57682 -1.049144 -1.138184
C  -2.794614 -2.33071 -0.786094
C  -5.580685 1.068295 -0.50995
C  -4.437757 1.422436 1.704448
C  -3.243576 2.053319 -0.451103
C  0.561767 -1.013134 0.121218
C  2.753185 0.068032 -0.427035
C  3.737994 -0.716358 0.249976
C  3.097568 1.384494 -0.83436
C  4.990844 -0.118016 0.537281
C  3.48355 -2.163035 0.616476
C  4.347803 1.964025 -0.57076
C  5.299262 1.200647 0.141855
H  -2.721063 -0.972951 2.007599
H  -1.764807 0.190668 1.052964
H  -1.350351 -2.594433 0.907348
H  -3.007774 -0.45736 -1.895662
H  -4.57271 -1.273569 -1.557544
H  -3.46335 -3.053146 -0.284896
H  -2.322943 -2.816353 -1.655561
H  -5.472641 0.869256 -1.591441
H  -6.043467 2.065623 -0.398243
H  -6.262552 0.312396 -0.080776
H  -3.488586 1.450329 2.268981
H  -5.11043 0.693719 2.191377
H  -4.89616 2.426025 1.768677
H  -2.257806 2.070078 0.049377
H  -3.663202 3.074593 -0.395709
H  -3.083315 1.811561 -1.518078
H  1.067168 -0.154545 -1.663356
H  5.744181 -0.714441 1.06378
H  4.432895 -2.679688 0.836313
H  2.821687 -2.23706 1.49758
H  2.976083 -2.699168 -0.206689
H  4.565218 2.982768 -0.902593
H  6.278751 1.632614 0.370652
