program: Gaussian 09
title: 000035742
version: EM64L-G09RevD.01
frameworkgroup: C1[X(C10H9ClN2O3)]
method: RPBEPBE
basis: SDD
operation: Freq
keyword: #p
keyword: freq=noraman
keyword: PBEPBE/SDD
title: #p freq=noraman PBEPBE/SDD
converged: YES YES NO NO
title: Mulliken charges:
elementType: Cl O O O N N C C C C C C C C C C H H H H H H H H H
charge: -0.054744 -0.227141 -0.194204 -0.230520 -0.085143 -0.416161 -0.452503 -0.424326 0.193854 0.480811 0.273596 -0.337205 -0.423157 -0.212877 -0.203439 -0.095434 0.279305 0.269069 0.238285 0.217764 0.358412 0.292031 0.237588 0.258772 0.257365
chargesum: 0.00000
title: Mulliken charges with hydrogens summed into heavy atoms:
elementType: Cl O O O N N C C C C C C C C C C
charge: -0.054744 -0.227141 -0.194204 -0.230520 -0.085143 -0.057749 0.095871 0.031722 0.193854 0.480811 0.273596 -0.045174 -0.185569 0.045895 0.053927 -0.095434
polarizability: 2.25043357e+02 -9.67201658e+00 1.33805417e+02 -5.20987050e+00 -1.22909991e+00 6.97481126e+01
1716.lowfreq: -7.8101 -0.0005 0.0005 0.0020 3.9680 5.7738 19.8833 30.7532 43.4445
frequency: 19.6689 30.7201 43.2810 76.4360 81.8178 149.5137 172.3087 193.1133 217.0957 264.1408 284.1327 334.1645 356.8394 391.9759 404.4185 410.7159 502.4072 533.8778 547.0951 578.0963 624.0951 639.0605 663.7781 668.1567 705.9045 712.1907 767.3609 807.8182 826.1434 840.2928 859.0348 880.4235 947.5596 976.1765 991.1421 995.3127 1002.5164 1055.8511 1071.0667 1113.5445 1132.5778 1149.1292 1174.4775 1180.4487 1188.9524 1227.0088 1256.6447 1299.6554 1304.6469 1332.5817 1334.9337 1382.6619 1399.2287 1456.3360 1471.6701 1480.2866 1588.0880 1603.4948 1684.9942 1714.1651 3004.3328 3008.8652 3078.4388 3080.5568 3132.5174 3141.5429 3171.9604 3174.9062 3577.1830
redmass: 8.5273 10.8893 4.3862 5.5370 6.9371 6.4086 7.7990 4.2291 4.7056 6.8642 7.7314 3.8757 10.5134 4.3215 6.1754 3.0501 3.3155 2.3310 4.5216 8.4996 6.9543 6.7595 1.5182 5.9589 5.2727 4.2833 4.6645 2.0895 2.5238 1.3817 3.6318 4.2484 1.3536 1.4795 1.6436 1.9241 3.9502 5.2771 2.7410 1.3507 2.8171 1.5931 1.1043 3.3971 1.1455 2.5465 4.1187 1.2777 1.6122 1.6221 1.8046 6.9174 2.5734 1.0830 1.1143 2.4551 7.3394 6.0338 7.9294 12.7207 1.0582 1.0610 1.1076 1.1025 1.0902 1.0918 1.0951 1.0961 1.0803
irintensity: 0.5755 0.5193 0.5034 1.3549 1.3243 2.1301 10.4589 0.8290 10.8812 6.4221 7.2892 0.4662 18.4188 12.7813 14.5135 0.5101 28.5040 4.8847 8.0222 2.4212 1.5566 12.4628 78.8786 17.0164 65.1808 24.7438 18.1424 45.2103 86.0385 31.4305 29.3978 18.4245 0.3241 1.0077 1.8075 1.2447 38.1309 124.2894 37.4371 10.9975 58.8877 3.4691 7.7762 63.7259 0.0838 8.3833 147.3202 4.6737 21.6723 10.3269 58.3353 2.5807 10.7922 23.4749 8.4285 68.7135 2.5975 31.3614 745.6759 104.3647 36.5401 15.5378 11.9959 7.8373 10.1365 2.5822 3.6706 3.1386 77.4682
temp: 298.150 k
press: 1.00000 atm
elementType: 17 8 8 8 7 7 6 6 6 6 6 6 6 6 6 6 1 1 1 1 1 1 1 1 1
symmnumber: 1
zpe: 469364.0 jmol-1
zpe.correction: 0.178771 hartree
zpe.thermalcorrener: 0.193156 hartree
zpe.thermalcorrenthalpy: 0.194100 hartree
zpe.thermalcorrgfe: 0.134515 hartree
zpe.sumelectzpe: -1180.510856 hartree
zpe.sumelectthermal: -1180.496472 hartree
zpe.sumelectthermalent: -1180.495527 hartree
zpe.sumelectthermalfe: -1180.555113 hartree
dipole: -0.7150 2.3795 1.2290
dipole: 2.7719
quadrupole: -122.0832 -89.9403 -100.3459
quadrupole: 5.8907 -2.5973 2.1158
quadrupole: -17.9601 14.1828 3.7773 5.8907 -2.5973 2.1158
hfenergy: -1180.6896274 hartree
pointgroup: C01 [X(C10H9Cl1N2O3)]
dipole: -0.2468794 -0.8426586 -0.6467641 debye
dipolederiv: -0.8375509 -0.1858331 -0.1863391 -0.2099452 -0.1800014 -0.0662543 -0.2195923 -0.0690348 -0.1292891 -0.6965059 0.0563114 0.1431977 -0.0246597 -0.2528677 0.0008475 0.2260017 0.0483498 -0.1637795 -1.3976238 -0.2038674 0.1509141 -0.1518387 -0.4824492 0.042431 0.1572167 0.0423421 -0.3628144 -0.8602262 -0.3704373 0.0576638 -0.2041394 -0.9660847 0.0425888 0.0812243 0.0613186 -0.3436737 -0.0316646 -0.1034314 0.0226613 0.2325954 -0.7195089 -0.0816666 0.3366815 -0.2422752 -0.2934339 -1.4850528 -0.2477351 0.1803833 -0.5555861 -0.7472866 0.1192955 0.2235169 0.0761811 -0.3952335 -0.0992518 0.3825835 -0.0200623 0.5468625 0.0403756 -0.0148935 -0.0704698 0.0512153 0.2840416 0.9708551 -0.0014904 -0.0652214 0.0390851 0.3556343 0.0739441 -0.4715513 0.1263737 0.3614724 1.6878566 0.2766119 -0.2130029 0.6024591 1.0856737 -0.1986138 -0.248223 -0.140423 0.2701306 -0.1413274 -0.0285686 0.0292512 -0.037847 -0.0902271 -0.0335894 0.0490377 -0.0416623 -0.0990411 1.7741144 0.3383946 -0.2382061 -0.2275931 1.515243 0.0668715 -0.3270977 0.0271188 0.3235378 0.0616709 -0.0461981 0.0114662 0.0712285 0.0057279 0.0410717 -0.0161385 0.0217278 -0.1052972 0.0881316 0.0623146 0.0564721 -0.120324 0.0760455 0.0468403 0.0649144 0.0635647 -0.1190471 -0.4090689 -0.0054214 -0.0501915 0.0046914 0.0246675 0.0231247 -0.0571466 0.0398603 -0.1112304 -0.2923402 -0.1647772 -0.06673 -0.2114159 -0.1079719 -0.0355505 -0.105772 -0.031989 -0.1287347 1.1732615 0.2736282 0.3123071 0.3183626 0.2304985 0.1333674 0.3490018 0.1335558 0.0402715 0.0848703 -0.0184796 -0.0301484 -0.0358748 0.0714914 0.0357955 0.0101019 0.0844629 -0.0189486 0.046088 -0.048489 0.0032778 -0.074985 0.0055605 -0.048809 -0.0205224 -0.0888812 0.0382796 -0.0861833 0.0070237 -0.0751056 0.0619089 0.0149654 0.0947302 0.0318438 0.0262834 -0.0047703 -0.0048857 0.0180759 0.0371524 -0.0097682 -0.1268863 -0.1161737 0.0620089 -0.0621508 0.014691 0.1713063 -0.0382133 0.0338351 -0.0616684 0.2174774 0.0204935 0.0296772 0.0237761 0.3668785 0.1274843 0.0595432 -0.021317 0.0459715 0.0671388 -0.0158468 -0.014302 -0.0153276 0.1400248 0.0719871 -0.0616205 -0.0360652 -0.0365144 -0.0667445 -0.0635056 -0.0266031 -0.0665601 0.128948 0.0844844 -0.02708 -0.0233701 -0.0335562 -0.0168978 -0.0508201 -0.0217252 -0.0528035 0.1460719 -0.0004291 0.0771556 -0.0128224 0.0725513 0.0464266 -0.0156785 -0.0220828 -0.0150229 0.160946 unknown
polarizability: 224.2253911|11.3853618|132.8134716|8.3743518|10.514195|71.5580241 unknown
InChI: InChI=1S/C10H9ClN2O3/c11-8-3-1-7(2-4-8)6-16-13-5-9(14)12-10(13)15/h1-4,12H,5-6H2
charge 0 multiplicity 1
25 atoms
Cl 5.864436 0.826872 0.732798
O  -0.683255 -0.724864 0.257664
O  -5.520183 -0.38096 0.543494
O  -1.520983 2.029045 -0.166464
N  -2.010078 -0.315745 -0.136029
N  -3.720602 1.117304 0.141229
C  -3.144366 -1.153097 0.295974
C  0.213477 -0.883137 -0.958148
C  -4.308795 -0.139118 0.354076
C  1.602621 -0.478726 -0.53419
C  -2.305212 1.061506 -0.056227
C  1.851137 0.860923 -0.133377
C  2.666175 -1.412684 -0.534079
C  3.145395 1.262689 0.2564
C  3.971095 -1.023998 -0.152899
C  4.186293 0.311237 0.235762
H  -2.9660 -1.589061 1.29722
H  -3.370782 -1.96473 -0.414847
H  -0.192601 -0.223992 -1.744277
H  0.164759 -1.93697 -1.288788
H  -4.236877 1.998167 0.122062
H  1.022829 1.578707 -0.115451
H  2.48381 -2.452308 -0.830828
H  3.342961 2.292257 0.567868
H  4.795944 -1.741915 -0.154547
