program: Gaussian 09
title: 000035810
version: EM64L-G09RevD.01
frameworkgroup: C1[X(C12H18N3)]
method: RPBEPBE
basis: SDD
operation: Freq
keyword: #p
keyword: freq=noraman
keyword: PBEPBE/SDD
title: #p freq=noraman PBEPBE/SDD
converged: YES YES NO NO
title: Mulliken charges:
elementType: N N N C C C C C C C C C C C C H H H H H H H H H H H H H H H H H H
charge: -0.132695 -0.297679 -0.379412 -0.395958 -0.367070 0.289178 0.247016 -0.063795 -0.341123 -0.298659 -0.376486 -0.299105 -0.201505 -0.183212 -0.667172 0.256918 0.255082 0.226240 0.226800 0.312277 0.265943 0.197600 0.213255 0.373784 0.222991 0.193904 0.266221 0.269826 0.262223 0.265355 0.212929 0.211457 0.234872
chargesum: 1.00000
title: Mulliken charges with hydrogens summed into heavy atoms:
elementType: N N N C C C C C C C C C C C C
charge: -0.132695 -0.031736 -0.005628 0.116042 0.085970 0.289178 0.247016 0.248482 0.069732 -0.032438 0.040409 -0.029279 0.060718 0.082142 -0.007915
polarizability: 2.15505274e+02 8.95098076e+00 1.52727873e+02 1.72834978e+01 -4.53395996e+00 9.14506535e+01
1716.lowfreq: -26.6241 -3.9057 -2.1710 -0.0007 -0.0006 0.0005 8.5016 33.5476 53.1653
frequency: -22.8897 33.4580 53.0516 60.0813 93.5461 112.4941 153.9386 191.9769 216.4685 218.0684 248.8139 257.6336 329.8645 410.3864 418.0263 452.4191 467.8186 537.4537 567.7348 589.7724 620.2928 636.7953 683.1780 732.0281 755.0263 756.7876 760.5263 764.9686 789.2914 831.0038 863.3517 876.8870 885.9613 901.9988 957.5995 977.1022 1002.9315 1011.5740 1027.3777 1049.2202 1062.8472 1077.2001 1110.5453 1127.6918 1139.0281 1155.8915 1160.1659 1180.3910 1200.5758 1234.8782 1237.3720 1265.4990 1277.2325 1287.1261 1293.3786 1302.9318 1320.6219 1350.6682 1353.2829 1384.0676 1396.1984 1406.6532 1422.6106 1456.1685 1459.3307 1464.4572 1473.3056 1479.9486 1480.6552 1484.4420 1492.2172 1496.3637 1536.3544 1614.9421 1629.2765 2893.1303 2901.4150 2971.8388 2982.9230 3004.8490 3032.3545 3040.7305 3041.1567 3078.6354 3089.3174 3111.5990 3160.5636 3167.9598 3178.4106 3189.6675 3262.9187 3462.4588 3580.9367
redmass: 2.7382 3.4006 2.5690 3.0095 2.7074 2.3286 2.2733 3.7291 1.2277 3.5282 3.3006 3.0276 4.1276 3.1725 2.9311 4.0673 3.5156 5.7509 3.5021 4.5236 2.0221 1.8051 1.1635 4.8619 3.6540 1.1172 3.3512 1.2973 1.3737 1.4545 1.4054 5.0914 1.2299 1.6025 1.3592 3.0440 1.3410 2.1158 4.1125 2.3871 3.2601 2.1286 1.7693 1.8829 1.7401 1.3107 2.7727 1.1792 1.5471 2.4692 1.3334 1.3687 1.3999 1.3825 1.4935 1.2904 1.4056 1.3578 1.6003 1.3660 1.2171 2.9913 5.0973 1.7337 1.3477 1.2801 1.0570 1.0467 1.0753 1.1054 2.3668 1.0883 4.3162 7.0615 7.0914 1.0698 1.0697 1.0653 1.0364 1.0881 1.0806 1.0709 1.0988 1.1010 1.0991 1.1061 1.0879 1.0910 1.0970 1.1009 1.1024 1.0748 1.0834
irintensity: 1.6568 0.7838 1.0455 0.9242 0.3311 4.3915 2.4212 1.3755 0.9593 12.3915 0.8475 0.1241 8.6130 7.4683 16.2582 2.8033 3.3743 1.3948 2.6249 5.8560 68.9331 44.1780 100.8968 3.3961 3.4444 6.8066 9.2994 148.4493 2.1174 2.9123 0.2872 1.3179 5.2600 2.2481 2.0505 3.4411 0.0438 3.2353 9.0835 13.7387 0.5025 19.0658 29.4129 3.8290 27.4772 17.9681 86.3279 2.4301 6.5604 11.7462 18.0811 13.2484 4.9243 3.7842 0.0490 6.5576 0.9733 21.4134 19.2436 1.2378 11.6444 30.2638 10.0310 26.8799 30.0121 8.1026 10.8197 15.6459 6.3562 1.4282 5.2690 21.0551 46.8559 14.3225 6.6348 64.4502 98.8629 27.4009 29.2923 27.9795 5.9559 15.2047 16.9739 65.3079 35.6897 4.9492 0.2522 1.2610 1.6365 0.7009 27.3534 4.8500 180.8703
temp: 298.150 k
press: 1.00000 atm
elementType: 7 7 7 6 6 6 6 6 6 6 6 6 6 6 6 1 1 1 1 1 1 1 1 1 1 1 1 1 1 1 1 1 1
symmnumber: 1
zpe: 749233.7 jmol-1
zpe.correction: 0.285368 hartree
zpe.thermalcorrener: 0.299321 hartree
zpe.thermalcorrenthalpy: 0.300265 hartree
zpe.thermalcorrgfe: 0.243418 hartree
zpe.sumelectzpe: -630.978892 hartree
zpe.sumelectthermal: -630.964939 hartree
zpe.sumelectthermalent: -630.963995 hartree
zpe.sumelectthermalfe: -631.020842 hartree
dipole: -6.6453 3.1695 -0.2875
dipole: 7.3681
quadrupole: -38.4741 -60.2853 -89.2519
quadrupole: -8.7356 5.1709 -3.7006
quadrupole: 24.1964 2.3851 -26.5815 -8.7356 5.1709 -3.7006
hfenergy: -631.2642603 hartree
pointgroup: C01 [X(C12H18N3)]
dipole: 2.5994783 -1.2583795 -0.2497806 debye
polarizability: 216.1162906|10.0876776|150.1827705|-14.5397757|12.6921801|93.3847395 unknown
InChI: InChI=1S/C12H18N3/c1-2-7-13-8-9-15-10-14-11-5-3-4-6-12(11)15/h3-6,10,13-14H,2,7-9H2,1H3
charge 1 multiplicity 1
33 atoms
N  0.679753 -0.893182 0.381768
N  -2.91458 0.294588 0.399736
N  2.405705 -1.957943 -0.528867
C  -0.694329 -0.611935 0.877396
C  -1.583437 0.109997 -0.178078
C  1.729298 0.055428 0.257786
C  2.838528 -0.629625 -0.323188
C  1.117112 -2.084695 -0.101125
C  -4.074836 0.241519 -0.527947
C  1.807057 1.418305 0.612076
C  -5.400086 0.399435 0.242253
C  4.064369 0.016745 -0.580312
C  3.032063 2.064989 0.357898
C  4.13796 1.378606 -0.228253
C  -6.625547 0.357359 -0.695346
H  -1.175591 -1.56305 1.156575
H  -0.604857 -0.000825 1.792519
H  -1.083192 1.049758 -0.512498
H  -1.675374 -0.536619 -1.070648
H  0.531191 -2.99909 -0.132687
H  -2.975405 1.091793 1.045466
H  -4.017356 1.022761 -1.323103
H  -4.062009 -0.742031 -1.037789
H  2.962771 -2.715968 -0.926122
H  -5.469345 -0.401221 1.002476
H  -5.391608 1.363315 0.792655
H  0.967689 1.9541 1.063256
H  4.917173 -0.502491 -1.026314
H  3.141189 3.122419 0.616101
H  5.067971 1.926237 -0.406725
H  -6.587877 1.170155 -1.444089
H  -6.680749 -0.603424 -1.240024
H  -7.562651 0.47139 -0.123348
