program: Gaussian 09
title: 000035844
version: EM64L-G09RevD.01
frameworkgroup: C1[X(C19H26N2O2)]
method: RPBEPBE
basis: SDD
operation: Freq
keyword: #p
keyword: freq=noraman
keyword: PBEPBE/SDD
title: #p freq=noraman PBEPBE/SDD
converged: YES YES NO NO
title: Mulliken charges:
elementType: O O N N C C C C C C C C C C C C C C C C C C C H H H H H H H H H H H H H H H H H H H H H H H H H H
charge: -0.314490 -0.342040 -0.048637 -0.417351 -0.063168 -0.063606 -0.458751 -0.232754 -0.445774 -0.449279 -0.217771 -0.457270 -0.459514 0.145734 -0.390028 -0.303775 0.256234 0.211847 -0.340359 -0.339651 -0.218786 -0.229165 -0.530104 0.190738 0.191925 0.192774 0.187444 0.204810 0.217690 0.195020 0.199723 0.207851 0.196525 0.208567 0.186126 0.186792 0.210329 0.350752 0.212934 0.245741 0.210677 0.244934 0.244216 0.251820 0.228798 0.230714 0.226970 0.261412 0.223175
chargesum: 0.00000
title: Mulliken charges with hydrogens summed into heavy atoms:
elementType: O O N N C C C C C C C C C C C C C C C C C C C
charge: -0.314490 -0.342040 -0.048637 -0.066599 0.127570 0.128320 -0.078532 -0.027944 -0.033064 -0.041704 -0.021246 -0.062577 -0.062393 0.145734 0.068647 0.151836 0.256234 0.211847 -0.096144 -0.087832 0.010012 0.001548 0.181453
polarizability: 2.05451983e+02 5.41426204e+00 2.20096364e+02 -7.46429848e+00 -1.09620707e+00 2.01516356e+02
1716.lowfreq: -22.0786 -15.3314 -0.0005 -0.0003 0.0006 6.7061 17.3075 22.0950 32.8522
frequency: 16.3029 20.7428 31.5538 57.6993 64.5782 92.9836 104.5121 137.4487 169.2706 172.4078 195.4848 225.2852 246.6287 272.9876 288.4799 294.8550 312.7768 328.6705 346.4315 363.9475 378.2182 391.2175 422.6754 439.2464 452.2943 490.0795 510.3087 539.2623 542.7668 560.4535 565.5934 584.4229 628.5400 652.0463 683.5620 695.8883 701.7779 747.4048 749.8823 762.8376 764.5716 777.6703 785.3801 810.1690 847.4736 853.8976 858.1306 875.4687 896.2121 902.5697 925.2280 931.3199 937.5372 952.1999 953.6523 965.0943 975.1457 986.8322 990.9164 1027.4110 1039.9914 1063.7665 1075.6159 1084.1160 1087.6530 1088.9030 1101.2258 1110.5213 1116.1497 1119.1006 1125.9028 1134.6369 1152.6010 1162.0756 1168.0676 1177.8851 1210.2450 1216.7254 1225.8679 1235.8685 1251.4653 1255.1879 1270.1391 1281.2716 1282.6623 1299.0239 1302.6674 1313.9970 1330.4589 1335.2927 1339.6051 1352.0288 1356.2906 1357.4682 1360.5782 1365.1228 1366.0497 1372.7303 1391.2078 1417.4867 1421.7327 1436.9038 1445.0659 1448.7008 1453.4548 1456.4792 1458.0813 1459.3972 1472.9949 1474.0660 1484.0916 1511.4202 1582.1971 1597.2541 1625.8039 2954.8615 2956.7467 2958.8793 2959.7412 2962.3292 2977.2707 2981.0956 2982.6222 2988.8996 2999.4379 3000.7005 3010.3036 3016.4629 3022.7790 3027.3248 3028.0144 3030.9001 3066.0318 3081.6620 3090.5103 3122.9231 3131.8833 3143.4863 3155.6300 3170.3979 3458.4030
redmass: 4.4143 4.1343 4.6263 4.5908 4.7305 4.2894 2.8972 2.7638 1.6973 1.8633 3.0309 3.0287 2.9902 4.4743 2.9259 4.3923 4.0570 2.5344 3.9482 2.9278 2.4538 1.8361 3.3044 2.7572 3.5237 4.0842 2.6308 4.3390 3.6231 3.9285 3.3772 4.3988 4.6610 1.6443 2.9102 5.1369 2.9794 3.4564 3.0176 1.5767 2.5521 3.2558 3.2772 3.4065 1.9564 1.6645 1.6849 3.0732 2.3423 2.0858 2.1417 2.0379 1.4630 4.4504 2.6539 2.7514 1.3102 4.9093 3.0044 2.0030 2.0637 2.0723 1.6750 2.4819 2.3502 1.5225 1.9244 1.2461 2.0451 1.0550 1.9068 1.0546 1.3693 1.1665 1.8295 1.2153 1.2828 1.2854 2.5874 1.2019 1.5220 1.5443 1.2765 1.6052 1.7949 1.9340 1.8718 1.9661 1.3253 1.2434 1.3413 1.3508 1.3959 1.3541 1.4805 1.5049 9.2736 1.2755 1.6181 1.3212 1.1149 1.7222 1.0799 1.0861 1.0881 1.0841 1.2146 1.1061 1.0996 2.0476 1.0636 1.6508 7.1229 6.4929 5.4701 1.0683 1.0666 1.0646 1.0630 1.0617 1.0311 1.0814 1.0798 1.0818 1.0646 1.0756 1.0575 1.1023 1.1001 1.0997 1.1009 1.1001 1.1029 1.1026 1.1096 1.1042 1.0851 1.0898 1.0949 1.1007 1.0804
irintensity: 0.6627 0.1259 1.3733 0.8128 0.9018 1.1923 9.2735 2.4252 2.3926 2.0107 4.5336 1.2644 0.9162 9.3733 5.0153 1.2937 2.9728 2.7097 0.9379 0.5126 1.8925 0.3836 9.4548 4.6466 1.7984 3.6679 0.4957 2.7389 4.3885 0.4165 9.1744 2.0013 5.3142 98.6353 41.9933 1.7746 7.2996 6.0882 15.5533 34.0901 1.9194 65.5458 4.3893 1.3736 3.9431 0.5795 10.8311 19.0429 15.6540 1.1605 0.8704 4.8937 3.2131 28.8759 46.3994 38.2970 0.1281 0.6698 25.3069 14.1811 6.7706 0.1607 4.4316 52.5259 6.6896 1.7638 3.3995 3.6665 9.3437 1.9807 18.2594 0.2339 1.4153 9.6331 26.3714 0.8597 14.8059 32.6230 124.6510 10.8265 3.3716 1.7712 80.4167 0.5269 2.3170 0.4802 5.9705 3.2781 0.1446 4.6621 0.1016 3.1924 7.2577 9.4406 2.5454 0.2839 4.3498 9.9460 8.2705 5.6066 22.1948 12.4824 1.3782 5.6220 17.1656 15.8838 18.1301 39.2143 10.5007 63.3874 18.7529 195.5852 4.4703 9.2519 199.4969 11.4797 7.0093 14.3945 22.9184 0.3413 94.1212 98.1150 155.0325 166.7226 83.5878 23.5316 41.3125 19.4560 1.9272 52.4038 50.6115 73.2972 12.3882 22.8506 41.3358 19.2948 0.8928 10.2729 16.5354 13.8663 185.1647
temp: 298.150 k
press: 1.00000 atm
elementType: 8 8 7 7 6 6 6 6 6 6 6 6 6 6 6 6 6 6 6 6 6 6 6 1 1 1 1 1 1 1 1 1 1 1 1 1 1 1 1 1 1 1 1 1 1 1 1 1 1
symmnumber: 1
zpe: 1101539.3 jmol-1
zpe.correction: 0.419554 hartree
zpe.thermalcorrener: 0.440034 hartree
zpe.thermalcorrenthalpy: 0.440978 hartree
zpe.thermalcorrgfe: 0.369094 hartree
zpe.sumelectzpe: -997.803269 hartree
zpe.sumelectthermal: -997.782789 hartree
zpe.sumelectthermalent: -997.781845 hartree
zpe.sumelectthermalfe: -997.853729 hartree
dipole: -1.1827 0.9931 0.8770
dipole: 1.7760
quadrupole: -134.8902 -130.9269 -131.5385
quadrupole: 3.6082 -1.2838 -2.2983
quadrupole: -2.4383 1.5250 0.9134 3.6082 -1.2838 -2.2983
hfenergy: -998.2228229 hartree
pointgroup: C01 [X(C19H26N2O2)]
dipole: 0.4972903 0.4525545 0.1900589 debye
polarizability: 204.2984481|5.4671801|202.9991861|-6.220799|5.1461159|219.7670691 unknown
InChI: InChI=1S/C19H26N2O2/c1-22-17-4-2-3-5-18(17)23-7-6-20-19-15-9-13-8-14(10-15)12-16(11-13)21-19/h2-5,13-16,20H,6-12H2,1H3
charge 0 multiplicity 1
49 atoms
O  2.608658 -1.358961 -1.221621
O  2.403987 1.481432 -1.305129
N  -1.8030 -1.36539 -0.672233
N  -0.093839 -0.229765 -1.783771
C  -2.664366 0.527444 1.900891
C  -4.114557 0.947279 -0.125087
C  -3.978262 1.183809 1.401776
C  -1.534665 1.160868 -0.355487
C  -1.455322 1.20191 1.198876
C  -2.931039 1.634653 -0.857453
C  -3.01817 -1.399436 0.182769
C  -2.73507 -1.003863 1.663012
C  -4.20629 -0.577268 -0.40036
C  -1.184856 -0.229613 -0.91216
C  0.41344 -1.473218 -2.365178
C  1.396886 -2.208737 -1.437991
C  2.662002 -0.622548 -0.019429
C  2.639749 0.800216 -0.082514
C  2.788015 -1.260916 1.235802
C  2.742452 1.562725 1.0997
C  2.881867 -0.49408 2.418852
C  2.858644 0.918679 2.352829
C  3.487667 1.363146 -2.310703
H  -2.560579 0.701345 2.991648
H  -5.052469 1.417918 -0.485082
H  -4.847727 0.746249 1.932878
H  -3.971526 2.270699 1.622101
H  -0.780099 1.871765 -0.747531
H  -0.505629 0.742155 1.535101
H  -1.425444 2.266894 1.509559
H  -3.005312 2.72851 -0.685402
H  -3.006702 1.472644 -1.950321
H  -3.329708 -2.462211 0.18476
H  -1.79352 -1.491528 1.983462
H  -3.547951 -1.417159 2.296002
H  -5.14647 -0.954304 0.05347
H  -4.269097 -0.773766 -1.488685
H  0.534935 0.581435 -1.793744
H  0.916726 -1.245961 -3.323205
H  -0.449539 -2.13854 -2.552756
H  1.763719 -3.138052 -1.908293
H  0.912806 -2.436771 -0.471407
H  2.818089 -2.355597 1.272536
H  2.70883 2.654163 1.018592
H  2.978723 -0.998657 3.386205
H  2.931816 1.515523 3.268049
H  3.135652 1.924942 -3.189631
H  3.660152 0.303932 -2.566909
H  4.414892 1.821607 -1.918292
