program: Gaussian 09
title: 000035752
version: EM64L-G09RevD.01
frameworkgroup: C1[X(C16H21NO3)]
method: RPBEPBE
basis: SDD
operation: Freq
keyword: #p
keyword: freq=noraman
keyword: PBEPBE/SDD
title: #p freq=noraman PBEPBE/SDD
converged: YES YES NO NO
title: Mulliken charges:
elementType: O O O N C C C C C C C C C C C C C C C C H H H H H H H H H H H H H H H H H H H H H
charge: -0.241418 -0.219295 -0.232474 -0.111464 -0.012548 -0.390186 -0.398698 -0.416732 -0.402502 -0.723580 0.187612 -0.419206 0.335044 -0.338287 -0.373564 0.305386 -0.351329 -0.332409 0.113710 -0.790343 0.196070 0.204009 0.202138 0.210082 0.206220 0.224512 0.220098 0.212654 0.268483 0.213682 0.212802 0.217968 0.233865 0.230015 0.242572 0.266657 0.238671 0.280841 0.235053 0.234959 0.260932
chargesum: 0.00000
title: Mulliken charges with hydrogens summed into heavy atoms:
elementType: O O O N C C C C C C C C C C C C C C C C
charge: -0.241418 -0.219295 -0.232474 -0.111464 0.183522 0.015962 0.017604 0.027878 0.078635 -0.079128 0.187612 0.044674 0.335044 -0.095715 -0.106907 0.305386 -0.112658 -0.051568 0.113710 -0.059399
polarizability: 2.95694285e+02 -1.92696921e+00 1.83680165e+02 -6.92469931e+00 -1.18502266e+01 1.16362895e+02
1716.lowfreq: -16.8377 -7.5484 -1.9210 -0.0008 -0.0006 -0.0004 16.6833 20.3788 39.0436
frequency: 16.6663 19.9562 38.9888 43.5286 64.5521 72.8539 116.9287 130.7774 131.8448 157.2486 173.4547 187.1417 193.7948 200.7505 255.7156 281.5395 286.2305 328.1327 340.8128 347.7246 413.6452 415.3681 436.4223 449.3813 456.5935 492.8414 497.4641 541.7696 559.9676 572.3899 590.8718 623.0625 628.8232 678.3568 741.0338 757.2952 782.3848 800.2369 808.3561 832.9291 858.9154 884.1991 923.4744 942.8270 943.4293 952.4959 957.4161 967.3583 997.9510 998.2761 999.7908 1009.6133 1018.0676 1026.0358 1044.0758 1071.1548 1094.3650 1116.5578 1130.7675 1135.9038 1154.0419 1177.4224 1202.6198 1212.1550 1225.9529 1237.1197 1256.5647 1262.5554 1279.7370 1294.2312 1300.3364 1308.0001 1331.1741 1337.6707 1347.5992 1352.2153 1362.3857 1364.2006 1379.6051 1389.4432 1414.9160 1429.0942 1447.3079 1449.2374 1459.2096 1461.0478 1462.6946 1469.4611 1473.3855 1476.5995 1477.8802 1497.3999 1558.2075 1595.2685 1613.4243 1619.5146 2940.1175 2941.4289 2949.4681 2958.0339 2969.7548 2974.0700 2981.8047 2983.3315 3000.0967 3036.8495 3045.0486 3065.1922 3067.9854 3070.0222 3080.7162 3087.1574 3124.0201 3140.3761 3153.3723 3162.9573 3175.2849
redmass: 4.2474 3.8263 4.9613 4.8510 6.1586 3.5409 6.2725 1.9214 1.3905 3.3230 2.7699 2.5052 3.1196 1.3291 2.7754 5.6912 2.5751 3.6156 2.3862 4.2927 3.8222 2.9920 1.9522 4.6536 2.9017 3.0707 4.3949 3.2446 4.6538 3.6264 2.3329 2.9724 6.4609 4.4690 3.4903 4.2407 2.5716 1.5481 1.3726 5.7273 1.4526 2.1523 2.2300 1.8554 1.5326 1.3542 1.5416 2.2695 1.8883 2.2476 1.5367 1.9367 3.8866 1.8043 2.4508 2.4195 2.4756 1.2773 2.4085 2.0040 1.3055 1.2875 2.2654 1.6278 1.1105 2.9964 1.3504 1.5481 3.8497 1.3622 1.2895 1.3131 1.2883 1.4658 1.3926 1.5371 1.4543 1.3373 3.7417 1.2194 2.5119 4.2485 1.1020 1.0904 1.1061 1.1376 1.0502 1.0869 1.0471 1.1060 1.0583 2.4057 6.6305 7.9052 9.1073 6.3713 1.0544 1.0823 1.0709 1.0697 1.0374 1.0587 1.0601 1.0374 1.1050 1.1020 1.1021 1.0991 1.0971 1.0993 1.0910 1.0934 1.0989 1.0871 1.0886 1.0955 1.0970
irintensity: 1.2435 0.0322 0.4596 0.3418 3.7408 0.7503 0.2173 0.3710 0.2814 0.0715 7.9066 7.1133 7.1622 3.0114 2.0413 0.8692 0.0405 7.2518 5.0109 3.1929 0.1097 0.0902 0.3848 2.5318 0.3104 6.8514 1.6889 5.4006 15.5793 13.1759 15.6989 10.5819 1.0335 0.3660 0.3406 1.1898 0.1565 0.4225 29.3711 12.5875 55.1334 4.4741 0.8935 43.1386 16.1656 15.4884 4.4800 76.4710 1.7482 0.9597 0.3872 12.1350 64.2638 1.2087 6.2071 5.6339 12.4908 19.1246 11.1783 47.6202 8.7851 242.6886 15.7042 215.9404 29.7052 123.0110 12.1674 38.0019 314.3886 14.4639 0.5014 1.4103 2.4174 1.7932 1.3660 9.8123 16.4964 34.4278 21.9500 9.4671 167.1382 34.4272 33.2695 3.5483 11.8722 18.3804 20.0408 12.4712 21.8568 8.2203 6.8188 36.3236 154.3312 213.9959 248.7833 152.3384 68.0122 9.4779 37.7501 59.8317 25.7053 34.7296 45.2707 4.5118 24.2675 34.6381 46.9518 67.5327 14.6285 39.5559 43.8497 4.8467 20.0253 13.1829 0.4867 16.8339 3.7728
temp: 298.150 k
press: 1.00000 atm
elementType: 8 8 8 7 6 6 6 6 6 6 6 6 6 6 6 6 6 6 6 6 1 1 1 1 1 1 1 1 1 1 1 1 1 1 1 1 1 1 1 1 1
symmnumber: 1
zpe: 891979.2 jmol-1
zpe.correction: 0.339737 hartree
zpe.thermalcorrener: 0.359715 hartree
zpe.thermalcorrenthalpy: 0.360659 hartree
zpe.thermalcorrgfe: 0.288582 hartree
zpe.sumelectzpe: -901.217612 hartree
zpe.sumelectthermal: -901.197634 hartree
zpe.sumelectthermalent: -901.196690 hartree
zpe.sumelectthermalfe: -901.268767 hartree
dipole: 6.4850 6.5054 -1.9114
dipole: 9.3824
quadrupole: -134.1510 -121.9987 -119.6224
quadrupole: -4.8322 1.7131 -1.2407
quadrupole: -8.8936 3.2587 5.6350 -4.8322 1.7131 -1.2407
hfenergy: -901.5573493 hartree
pointgroup: C01 [X(C16H21N1O3)]
dipole: -2.5506202 2.3965518 1.173278 debye
polarizability: 295.9560593|1.0913641|176.5207726|-1.7844653|23.9431044|123.2605124 unknown
InChI: InChI=1S/C16H21NO3/c1-12-7-9-17(10-8-12)16(19)11-20-15-5-3-14(4-6-15)13(2)18/h3-6,12H,7-11H2,1-2H3
charge 0 multiplicity 1
41 atoms
O  -1.959199 -2.25964 -0.617583
O  0.447035 -1.151002 -0.271291
O  6.794974 -0.173834 -0.328571
N  -3.138907 -0.48286 0.324831
C  -5.581289 1.118434 -0.054139
C  -4.190866 1.772437 0.150241
C  -5.402177 -0.280158 -0.697877
C  -3.239745 0.851726 0.953068
C  -4.43799 -1.166209 0.119845
C  -6.514181 2.019639 -0.889155
C  -1.966381 -1.118861 -0.074645
C  -0.662905 -0.328981 0.192793
C  1.736688 -0.630071 -0.135514
C  2.049002 0.639358 0.417772
C  2.774095 -1.480945 -0.604095
C  4.445684 0.209137 0.031902
C  3.397515 1.045028 0.495045
C  4.106779 -1.062642 -0.519284
C  5.888066 0.604388 0.097004
C  6.256956 1.965157 0.6861
H  -6.03764 0.97367 0.950512
H  -4.295829 2.73779 0.683449
H  -3.741517 1.987734 -0.840415
H  -5.005826 -0.16447 -1.726522
H  -6.381624 -0.790273 -0.778599
H  -2.243833 1.315069 1.035741
H  -3.633653 0.732218 1.985543
H  -4.883185 -1.390196 1.112545
H  -4.227881 -2.120941 -0.38839
H  -6.653034 3.008156 -0.412724
H  -6.096368 2.18716 -1.900387
H  -7.511822 1.558297 -1.010045
H  -0.553902 -0.118683 1.277562
H  -0.677575 0.636466 -0.355666
H  1.264809 1.30769 0.785166
H  2.498061 -2.452479 -1.024041
H  3.625913 2.026847 0.92347
H  4.922278 -1.701333 -0.873931
H  5.916813 2.051622 1.735062
H  5.787947 2.787975 0.114726
H  7.350613 2.082479 0.652497
