program: Gaussian 09
title: 000035803
version: EM64L-G09RevD.01
frameworkgroup: C1[X(C13H13N3O3)]
method: RPBEPBE
basis: SDD
operation: Freq
keyword: #p
keyword: freq=noraman
keyword: PBEPBE/SDD
title: #p freq=noraman PBEPBE/SDD
converged: YES YES NO NO
title: Mulliken charges:
elementType: O O O N N N C C C C C C C C C C C C C H H H H H H H H H H H H H
charge: -0.257095 -0.319979 -0.191869 -0.498027 -0.026695 -0.405135 -0.336306 -0.478522 -0.479872 0.136691 0.366312 -0.499885 -0.349480 0.325980 0.021035 -0.346835 0.171451 0.271070 -0.491980 0.237552 0.242329 0.266191 0.265106 0.242962 0.286097 0.219861 0.252903 0.312445 0.336837 0.246076 0.234394 0.246390
chargesum: 0.00000
title: Mulliken charges with hydrogens summed into heavy atoms:
elementType: O O O N N N C C C C C C C C C C C C C
charge: -0.257095 -0.319979 -0.191869 -0.185582 -0.026695 -0.068298 -0.098754 0.029999 0.028196 0.136691 0.366312 -0.213788 -0.129620 0.325980 0.021035 -0.093933 0.171451 0.271070 0.234880
polarizability: 3.51642716e+02 -2.05069617e+00 1.56207538e+02 1.29003416e-01 -1.25512820e-01 8.75375544e+01
1716.lowfreq: -20.1199 -0.6314 -0.0008 -0.0004 0.0007 2.3850 7.7968 21.6909 28.4759
frequency: -20.0616 21.0261 28.3350 47.4209 64.0428 81.1670 103.4106 130.2292 153.2204 201.4843 207.8274 231.5372 249.9662 276.5724 278.7154 318.1981 353.7273 372.2526 424.8571 434.5531 508.0289 513.4470 575.2976 594.5376 604.9582 645.6461 666.2604 680.1325 701.7895 723.3592 725.9804 738.5307 777.3108 790.2641 796.2671 831.7313 839.2065 856.4287 876.9788 893.7538 925.1791 929.7613 959.9162 968.9031 1014.7674 1044.9866 1048.8607 1080.4337 1083.4590 1088.7867 1120.6594 1129.3574 1137.6857 1159.4634 1160.3698 1178.7890 1204.7341 1216.2723 1226.5610 1279.9912 1282.5650 1333.0459 1378.5263 1390.5077 1420.7987 1427.0567 1442.1899 1452.8768 1458.4711 1468.3984 1489.8113 1514.2652 1538.7233 1568.2970 1597.5974 1646.1573 1707.7465 3004.7772 3100.1596 3106.7407 3106.9053 3148.9057 3152.5027 3153.3706 3170.9171 3179.6486 3207.6126 3226.3602 3553.5058 3590.3628
redmass: 6.8046 3.6501 3.4759 4.8991 5.1768 1.1950 4.2360 5.0715 4.0223 5.0383 6.4874 4.5531 3.4369 4.2987 3.8661 7.9641 5.5582 5.3306 7.9446 3.0296 1.2820 4.8144 6.3043 4.4167 1.2295 5.7176 5.8560 7.1647 8.3415 3.4463 2.8453 6.0940 4.0846 2.6702 1.1354 1.5611 5.2459 5.4750 1.6186 6.5859 4.8151 1.5661 1.3788 8.3125 2.2495 5.8855 1.2560 1.2105 1.4622 1.1950 1.2561 1.9484 1.8374 1.8172 2.0558 1.3731 2.4004 1.8885 1.9809 5.8004 1.9076 2.2380 3.4321 2.3473 1.0891 1.1548 1.3689 1.0486 4.6104 1.0576 3.6284 2.0001 6.0834 7.2308 8.3424 7.2902 8.9641 1.0298 1.0499 1.1050 1.0612 1.1045 1.0895 1.0918 1.0916 1.0948 1.1182 1.1158 1.0764 1.0813
irintensity: 1.5680 5.4669 0.0388 0.0875 2.0222 2.3124 4.9651 1.8025 0.6718 17.6730 2.1417 16.0917 1.6700 0.7598 0.5247 20.0364 2.8226 0.1397 0.6134 10.6752 11.2520 8.4148 1.3688 4.3184 163.8842 4.0748 28.6751 8.1191 48.8365 25.0989 5.8193 1.4358 1.0050 0.3063 5.3128 36.3010 4.3742 11.3611 11.6311 3.7135 83.8711 21.3735 1.1681 3.0944 101.1272 206.8187 15.6984 13.7842 9.4407 0.9047 0.4846 418.7776 285.2153 260.9017 37.1670 0.2268 9.3426 16.9657 15.6576 137.2170 142.6005 56.5983 63.5276 297.1471 11.8569 13.2923 15.8703 14.4716 25.9962 38.1197 92.1836 50.4319 596.2587 495.7375 278.5111 4.4774 257.9917 48.8727 17.4550 26.1213 15.8327 16.8826 10.7201 0.1945 1.3357 14.4479 0.2907 12.8832 55.9712 43.0015
temp: 298.150 k
press: 1.00000 atm
elementType: 8 8 8 7 7 7 6 6 6 6 6 6 6 6 6 6 6 6 6 1 1 1 1 1 1 1 1 1 1 1 1 1
symmnumber: 1
zpe: 640577.5 jmol-1
zpe.correction: 0.243983 hartree
zpe.thermalcorrener: 0.260646 hartree
zpe.thermalcorrenthalpy: 0.261590 hartree
zpe.thermalcorrgfe: 0.197442 hartree
zpe.sumelectzpe: -891.731609 hartree
zpe.sumelectthermal: -891.714946 hartree
zpe.sumelectthermalent: -891.714002 hartree
zpe.sumelectthermalfe: -891.778150 hartree
dipole: 2.5817 -2.5262 0.1477
dipole: 3.6151
quadrupole: -86.2141 -107.4072 -111.9389
quadrupole: -28.8806 -0.4928 -0.2064
quadrupole: 15.6393 -5.5538 -10.0855 -28.8806 -0.4928 -0.2064
hfenergy: -891.975592 hartree
pointgroup: C01 [X(C13H13N3O3)]
dipole: 1.0116489 0.951415 -0.3070471 debye
polarizability: 351.3482065|5.3614497|150.7511571|7.1596255|-18.5805751|93.2884456 unknown
InChI: InChI=1S/C13H13N3O3/c1-19-13(18)16-12-14-9-5-4-8(6-10(9)15-12)11(17)7-2-3-7/h4-7,15-16H,2-3H2,1H3
charge 0 multiplicity 1
32 atoms
O  -4.013706 1.562749 -0.602212
O  5.825511 0.782519 -0.118702
O  4.810176 -1.265281 0.466308
N  1.233115 1.186592 -0.387885
N  1.799366 -0.94017 0.267362
N  3.584459 0.687245 -0.162271
C  -4.867611 -0.623929 -0.111831
C  -6.146985 -0.40272 -0.962343
C  -6.182016 -0.084652 0.518947
C  -3.7482 0.352667 -0.296294
C  -2.322827 -0.086084 -0.124598
C  -1.320901 0.890846 -0.381567
C  -1.95048 -1.407587 0.282734
C  0.011955 0.502347 -0.222886
C  0.395479 -0.823681 0.186216
C  -0.604096 -1.787496 0.442619
C  2.25571 0.270604 -0.080626
C  4.727628 -0.079327 0.105804
C  7.147602 0.161738 0.111935
H  -4.613137 -1.660165 0.115185
H  -6.658734 -1.296805 -1.328776
H  -6.105737 0.444839 -1.651714
H  -6.16354 0.971317 0.801661
H  -6.717098 -0.75457 1.197459
H  -1.639556 1.892823 -0.686609
H  -2.724742 -2.152623 0.485815
H  -0.325581 -2.797169 0.756696
H  1.337519 2.158161 -0.675202
H  3.780331 1.649315 -0.445073
H  7.236615 -0.171571 1.159528
H  7.87346 0.955673 -0.112487
H  7.286519 -0.703303 -0.557994
