program: Gaussian 09
title: 000035808
version: EM64L-G09RevD.01
frameworkgroup: C1[X(C11H16N3)]
method: RPBEPBE
basis: SDD
operation: Freq
keyword: #p
keyword: freq=noraman
keyword: PBEPBE/SDD
title: #p freq=noraman PBEPBE/SDD
converged: YES YES NO NO
title: Mulliken charges:
elementType: N N N C C C C C C C C C C C H H H H H H H H H H H H H H H H
charge: -0.129327 -0.380808 -0.317458 -0.388846 0.292225 -0.380651 0.251380 -0.070176 -0.306758 -0.299683 -0.321713 -0.198871 -0.183970 -0.681067 0.253385 0.266100 0.244957 0.205912 0.310859 0.372697 0.298958 0.268440 0.269098 0.208321 0.202973 0.262311 0.264952 0.235368 0.216558 0.234835
chargesum: 1.00000
title: Mulliken charges with hydrogens summed into heavy atoms:
elementType: N N N C C C C C C C C C C C
charge: -0.129327 -0.008111 -0.018500 0.130638 0.292225 0.070218 0.251380 0.240682 -0.038317 -0.030585 0.089581 0.063439 0.080982 0.005694
polarizability: 2.17925181e+02 2.18212000e+00 1.43902900e+02 9.52205503e+00 -2.59876738e+00 7.67380166e+01
1716.lowfreq: -9.7321 -0.0004 -0.0003 0.0004 2.2511 12.4257 26.9110 35.9880 45.1068
frequency: 26.8653 35.5890 45.0965 77.7814 92.2155 199.3329 218.0563 234.0565 249.8811 263.4509 308.7762 355.9891 418.9123 444.2280 465.1585 501.8011 542.7605 567.9967 591.9859 629.4982 677.0801 734.7887 755.6758 761.3041 766.5208 787.9159 809.4891 821.2448 866.6140 872.4660 877.7602 959.4981 992.3798 1003.8923 1011.8695 1035.3105 1045.3438 1069.3915 1107.1059 1127.7672 1147.0518 1155.8560 1181.4574 1185.3180 1214.6933 1233.2880 1259.1755 1269.9192 1283.8250 1293.3710 1314.7928 1352.7992 1355.6270 1366.0631 1399.0151 1406.5873 1422.3865 1452.9421 1455.7941 1461.4480 1472.5004 1475.5748 1482.0545 1491.7422 1499.3606 1534.1082 1614.9958 1628.8016 2884.3487 2898.4707 2985.4837 2990.4785 3040.0362 3050.3090 3083.7825 3104.6319 3120.7262 3160.4764 3167.7895 3178.1925 3189.6445 3264.2539 3526.5408 3582.2669
redmass: 3.8623 2.5045 2.3409 3.2610 3.1908 3.7266 4.0792 1.3532 1.7379 2.4760 3.4018 3.6674 2.9069 1.8540 3.3271 2.3490 4.7306 3.4898 4.3566 3.9459 1.1656 4.0939 3.7521 4.3086 1.2704 1.4293 1.1086 1.4562 1.3988 2.3332 3.2606 1.3603 3.9628 1.3419 2.1127 2.1811 2.7936 2.7276 1.9335 1.6230 1.5815 1.2739 1.2112 2.6196 1.8126 2.5246 1.1368 1.4739 2.2095 1.2056 1.4731 1.4373 1.4052 1.2874 1.2303 3.1026 4.7520 1.2334 1.7748 1.3045 1.1724 1.0577 1.0588 2.3404 1.0841 4.0476 7.0495 7.0842 1.0700 1.0692 1.0814 1.0464 1.0883 1.0633 1.0985 1.1004 1.1069 1.0879 1.0910 1.0969 1.1009 1.1021 1.0769 1.0833
irintensity: 1.0381 0.4122 0.4028 2.1847 0.5714 0.1376 14.0780 1.9435 2.6881 17.9625 3.4736 23.1781 11.9399 91.3602 2.2678 64.6518 4.5043 2.3671 4.4000 8.0661 97.7055 0.9666 7.6112 9.1488 144.2960 3.3675 6.2832 3.7357 0.1764 0.3155 1.3519 2.4405 22.9621 0.0459 1.8283 13.9755 10.6089 1.3850 4.2222 32.8346 9.5294 8.0448 3.5081 85.9517 43.1679 15.7255 5.2003 4.6640 5.2636 16.7730 2.1342 31.0182 6.5031 23.2745 20.7475 41.3723 11.5643 12.8093 28.3674 5.8840 21.0364 12.5133 7.3923 4.3063 12.6876 35.4678 16.5480 7.0434 54.0341 93.8290 20.3370 40.6193 9.0564 15.2363 37.1017 25.6093 4.6470 0.3202 1.0921 1.1689 0.8947 23.3727 22.3531 191.0797
temp: 298.150 k
press: 1.00000 atm
elementType: 7 7 7 6 6 6 6 6 6 6 6 6 6 6 1 1 1 1 1 1 1 1 1 1 1 1 1 1 1 1
symmnumber: 1
zpe: 675835.2 jmol-1
zpe.correction: 0.257412 hartree
zpe.thermalcorrener: 0.270867 hartree
zpe.thermalcorrenthalpy: 0.271812 hartree
zpe.thermalcorrgfe: 0.215462 hartree
zpe.sumelectzpe: -591.756940 hartree
zpe.sumelectthermal: -591.743485 hartree
zpe.sumelectthermalent: -591.742541 hartree
zpe.sumelectthermalfe: -591.798891 hartree
dipole: -3.3530 3.5160 -0.5894
dipole: 4.8941
quadrupole: -37.5299 -54.7138 -83.8959
quadrupole: -4.4193 1.2402 0.1395
quadrupole: 21.1833 3.9994 -25.1827 -4.4193 1.2402 0.1395
hfenergy: -592.0143524 hartree
pointgroup: C01 [X(C11H16N3)]
dipole: -1.3207098 -1.2767254 0.5771921 debye
polarizability: 218.2148289|-3.871804|137.5573227|-6.2972737|-19.8577803|82.7939466 unknown
InChI: InChI=1S/C11H16N3/c1-2-12-7-8-14-9-13-10-5-3-4-6-11(10)14/h3-6,9,12-13H,2,7-8H2,1H3
charge 1 multiplicity 1
30 atoms
N  -0.059514 -0.693941 -0.205313
N  -1.70957 -1.904802 0.666247
N  3.37965 0.843982 0.1887
C  1.306092 -0.247862 -0.574777
C  -1.231076 0.108169 -0.255508
C  2.039766 0.471962 0.607855
C  -2.29052 -0.671961 0.297218
C  -0.379622 -1.887559 0.359664
C  -1.450091 1.414472 -0.738772
C  -3.608481 -0.18107 0.390222
C  4.469239 -0.141052 0.367722
C  -2.766855 1.906404 -0.646277
C  -3.824771 1.124445 -0.092769
C  5.810827 0.437145 -0.110492
H  1.8878 -1.129108 -0.892795
H  1.231242 0.434465 -1.435702
H  1.465899 1.373533 0.890691
H  2.033071 -0.213414 1.490178
H  0.313628 -2.707332 0.525318
H  -2.197418 -2.695183 1.090182
H  3.652854 1.806763 0.401071
H  -0.648755 2.022306 -1.167556
H  -4.425024 -0.774378 0.811005
H  4.555212 -0.462204 1.433312
H  4.234868 -1.050181 -0.222289
H  -2.986578 2.914734 -1.009186
H  -4.830759 1.551407 -0.043974
H  5.760234 0.717357 -1.176742
H  6.088391 1.335825 0.472086
H  6.618863 -0.30312 0.01758
