program: Gaussian 09
title: 000035890
version: EM64L-G09RevD.01
frameworkgroup: C1[X(C18H19NOS)]
method: RPBEPBE
basis: SDD
operation: Freq
keyword: #p
keyword: freq=noraman
keyword: PBEPBE/SDD
title: #p freq=noraman PBEPBE/SDD
converged: YES YES NO NO
title: Mulliken charges:
elementType: S O N C C C C C C C C C C C C C C C C C C H H H H H H H H H H H H H H H H H H H
charge: 0.227367 -0.310679 -0.092718 0.280488 0.325369 -0.360615 -0.282949 0.492972 -0.389607 -0.445897 -0.364973 -0.349186 -0.236307 -0.388072 -0.246789 -0.612995 -0.612261 -0.244917 -0.235974 -0.247200 -0.237252 0.216808 0.199371 0.216085 0.233580 0.238215 0.268010 0.256556 0.241461 0.254455 0.225392 0.189925 0.224558 0.227082 0.189519 0.222362 0.232599 0.233735 0.230369 0.232113
chargesum: 0.00000
title: Mulliken charges with hydrogens summed into heavy atoms:
elementType: S O N C C C C C C C C C C C C C C C C C C
charge: 0.227367 -0.310679 -0.092718 0.280488 0.325369 0.055563 0.166717 0.492972 -0.389607 -0.207683 -0.364973 -0.081176 0.020248 -0.146611 0.007666 0.026881 0.026701 -0.012317 -0.002239 -0.016831 -0.005139
polarizability: 2.97232673e+02 -4.13854213e+01 2.42739404e+02 1.95174325e+01 1.25687855e+01 1.56138224e+02
1716.lowfreq: -12.8189 -8.7676 -0.0017 0.0004 0.0013 1.5392 4.7508 19.7360 37.8256
frequency: -10.8741 19.4713 37.7830 52.1538 81.4418 89.3067 110.0185 126.3463 150.7386 168.9598 203.2932 221.6466 227.4683 244.6790 279.2917 282.5949 294.6163 325.7148 339.4217 359.9183 401.8215 412.3327 422.5924 447.2001 454.6056 467.4194 508.7385 525.5662 541.8203 591.6752 621.6297 649.1991 663.4861 670.5107 728.4209 747.4245 756.5824 766.3624 775.8127 807.0516 819.4461 852.7045 861.7624 887.8102 889.8956 939.8978 952.8795 964.4818 986.6828 995.2179 1014.5440 1027.7275 1029.5461 1033.7612 1034.6426 1044.3155 1060.8408 1070.1049 1089.7514 1096.6742 1123.9583 1126.9617 1139.5274 1164.0935 1171.5721 1172.1450 1181.7145 1229.4768 1238.7997 1255.1814 1256.7230 1265.9920 1289.0365 1328.1291 1347.3839 1369.1923 1377.0871 1388.6069 1414.9618 1419.6858 1420.2909 1443.3632 1460.4153 1460.9103 1464.9503 1467.3768 1475.2139 1476.7154 1485.9654 1490.6859 1561.7066 1563.5776 1594.4543 1594.8193 1634.9736 2850.8697 2860.6982 2884.4558 2985.5496 3020.4524 3029.4554 3035.5971 3061.2956 3079.4063 3087.3144 3112.6473 3124.3798 3131.0649 3136.9250 3142.4913 3150.3855 3154.5398 3166.8242 3168.4154
redmass: 2.5187 4.5212 5.3351 5.2096 3.7208 2.0999 3.3711 3.5950 4.6006 4.0649 4.7664 1.1101 1.4088 3.1158 3.5554 6.2509 5.0324 5.5828 3.5606 2.9726 3.3251 4.7928 4.8150 3.2950 3.4118 3.5821 5.7932 4.2032 3.7746 6.1632 4.6637 4.8456 6.3779 6.4007 4.4642 2.2321 2.8189 1.8373 1.4941 1.2944 3.2170 3.3968 1.4802 1.4229 1.6083 5.6756 1.4296 1.3746 1.3345 1.3289 6.7694 3.1417 4.0443 1.6101 2.7781 2.2089 1.7305 2.7639 1.3729 2.3541 1.7130 1.6311 1.4587 1.4122 1.0844 1.0651 1.9926 2.2753 1.7541 1.4694 1.5135 2.5495 1.2390 1.3494 2.4562 7.5778 3.3697 1.4464 2.1313 1.6611 1.3861 1.1628 1.2522 1.7624 2.7352 1.0651 1.0724 1.0608 1.0561 1.0846 6.0861 6.3946 6.5727 6.3797 8.6572 1.0570 1.0586 1.0682 1.0580 1.0726 1.0734 1.0892 1.1053 1.1008 1.1005 1.0876 1.0863 1.0852 1.0888 1.0895 1.0943 1.0947 1.1007 1.1008
irintensity: 0.4402 0.3204 0.2922 1.4941 0.1138 1.5561 2.8151 0.9389 0.3391 0.5585 1.2563 1.0042 0.4618 2.4110 0.8180 1.6062 5.3935 0.8714 7.6906 5.1298 2.0635 1.8101 1.6212 3.0159 9.4806 13.2268 1.3771 9.2645 0.6068 7.8217 2.7599 5.5472 1.1029 3.0523 3.3075 10.2000 25.7129 46.5814 82.5285 5.0770 11.4741 9.2087 13.2199 2.3111 18.1187 55.2486 5.0541 4.3533 0.0387 1.6539 88.4234 8.4026 5.7624 11.3563 108.7552 6.9763 34.4065 108.8846 6.3983 3.6027 2.3347 12.0790 4.3265 1.5717 2.9071 0.1544 80.4529 34.3543 5.4046 4.4575 10.7477 14.2894 4.2789 4.8505 14.0208 2.1025 16.4870 3.7870 11.1324 8.6142 9.7958 3.8592 1.9356 17.8855 55.0165 4.2503 19.4662 9.4547 10.9860 10.3276 9.2677 1.2327 2.8824 1.7577 61.2185 69.4708 157.5802 127.7202 35.9923 40.2752 52.1131 1.4698 42.3190 38.2123 47.5126 6.7653 4.2531 0.6403 6.1230 5.3322 19.1069 14.6513 36.5310 24.8348
temp: 298.150 k
press: 1.00000 atm
elementType: 16 8 7 6 6 6 6 6 6 6 6 6 6 6 6 6 6 6 6 6 6 1 1 1 1 1 1 1 1 1 1 1 1 1 1 1 1 1 1 1
symmnumber: 1
zpe: 844959.6 jmol-1
zpe.correction: 0.321828 hartree
zpe.thermalcorrener: 0.340665 hartree
zpe.thermalcorrenthalpy: 0.341609 hartree
zpe.thermalcorrgfe: 0.273853 hartree
zpe.sumelectzpe: -1223.789818 hartree
zpe.sumelectthermal: -1223.770981 hartree
zpe.sumelectthermalent: -1223.770037 hartree
zpe.sumelectthermalfe: -1223.837793 hartree
dipole: -1.1520 0.0837 -0.9209
dipole: 1.4772
quadrupole: -111.9885 -119.6908 -133.7866
quadrupole: 0.6763 0.5842 0.0307
quadrupole: 9.8335 2.1311 -11.9646 0.6763 0.5842 0.0307
hfenergy: -1224.1116459 hartree
pointgroup: C01 [X(C18H19N1O1S1)]
dipole: -0.4499072 -0.0939752 0.3556894 debye
polarizability: 296.4773459|44.5718297|237.0034764|-13.7526474|25.3255015|162.6294787 unknown
InChI: InChI=1S/C18H19NOS/c1-19(2)11-12-20-16-13-14-7-3-5-9-17(14)21-18-10-6-4-8-15(16)18/h3-10,13H,11-12H2,1-2H3
charge 0 multiplicity 1
40 atoms
S  1.972854 -0.291606 -1.922217
O  -1.459896 0.800626 0.807474
N  -5.009988 0.736969 -0.396614
C  -0.142561 0.453851 0.396137
C  0.078492 -0.984127 0.096654
C  -3.85237 0.91624 0.510242
C  -2.534845 0.559522 -0.19178
C  2.247638 1.405739 0.357236
C  1.01711 -1.459943 -0.860142
C  0.788429 1.45382 0.524872
C  2.921569 0.629606 -0.631798
C  -0.680115 -1.948868 0.822923
C  1.190783 -2.844953 -1.079993
C  3.052245 2.22553 1.204787
C  4.329852 0.639714 -0.736826
C  -5.158891 1.834039 -1.375777
C  -6.269761 0.480146 0.330748
C  -0.518296 -3.329207 0.596981
C  0.417396 -3.783462 -0.362248
C  4.455976 2.251193 1.094748
C  5.102926 1.45197 0.122866
H  -3.972814 0.237685 1.37438
H  -3.780497 1.954552 0.91881
H  -2.341677 1.200629 -1.073842
H  -2.546154 -0.497762 -0.5145
H  0.382125 2.403456 0.898795
H  -1.387697 -1.587171 1.576786
H  1.927076 -3.17827 -1.818213
H  2.552968 2.837963 1.964951
H  4.81239 0.022606 -1.501605
H  -5.975114 1.591433 -2.079338
H  -5.394174 2.818758 -0.896473
H  -4.234379 1.954741 -1.965581
H  -6.15215 -0.402266 0.984186
H  -6.603547 1.340705 0.965028
H  -7.075392 0.26201 -0.393424
H  -1.113545 -4.048515 1.169667
H  0.547855 -4.855049 -0.547868
H  5.044291 2.889739 1.7627
H  6.193985 1.465357 0.027968
