program: Gaussian 09
title: 000035816
version: EM64L-G09RevD.01
frameworkgroup: C1[X(C16H18N3)]
method: RPBEPBE
basis: SDD
operation: Freq
keyword: #p
keyword: freq=noraman
keyword: PBEPBE/SDD
title: #p freq=noraman PBEPBE/SDD
converged: YES YES NO NO
title: Mulliken charges:
elementType: N N N C C C C C C C C C C C C C C C C H H H H H H H H H H H H H H H H H H
charge: -0.132579 -0.379258 -0.308477 -0.396109 0.289390 -0.367559 0.247699 -0.062944 -0.502910 -0.299389 -0.299048 0.428638 -0.200784 -0.183160 -0.439745 -0.367087 -0.213319 -0.217943 -0.232826 0.256665 0.255818 0.227217 0.227095 0.312229 0.374073 0.279611 0.213619 0.230645 0.266806 0.269957 0.262588 0.265545 0.235632 0.246181 0.238161 0.234267 0.241304
chargesum: 1.00000
title: Mulliken charges with hydrogens summed into heavy atoms:
elementType: N N N C C C C C C C C C C C C C C C C
charge: -0.132579 -0.005185 -0.028867 0.116373 0.289390 0.086753 0.247699 0.249286 -0.058646 -0.032583 -0.029091 0.428638 0.061804 0.082384 -0.204113 -0.120906 0.024841 0.016324 0.008478
polarizability: 2.81848544e+02 6.84227474e-01 1.73978826e+02 1.93342095e+01 4.62308529e+00 1.23413629e+02
1716.lowfreq: -7.2233 -3.9907 -0.0006 -0.0004 0.0003 6.5118 14.0239 21.3274 33.5273
frequency: 12.9535 20.5393 33.4964 39.1763 64.4938 78.8458 120.6842 167.2928 217.7172 221.3583 250.8442 273.2562 290.3871 381.2977 404.5529 408.3819 417.8260 466.9251 481.4012 536.6034 567.7982 586.0271 596.7686 616.3079 627.6591 646.3496 683.5201 705.0561 731.6776 752.1888 755.5194 760.2635 765.4269 787.9130 816.8346 832.5794 857.8765 863.4372 877.0458 919.7415 957.0850 957.7415 981.6017 986.6923 991.2308 1003.5694 1004.3096 1011.2547 1026.2027 1030.9089 1059.7081 1085.0521 1100.3878 1123.9027 1147.4688 1157.0685 1168.5972 1175.9396 1183.3221 1185.8505 1215.5529 1224.7523 1234.7923 1266.6937 1279.7367 1291.3906 1305.7753 1320.1818 1342.4679 1353.7029 1374.5376 1391.8288 1406.9316 1422.0347 1442.9573 1454.9745 1456.9483 1462.8286 1479.7578 1483.4463 1490.6640 1492.0322 1536.3978 1596.2078 1614.8022 1614.8831 1628.6907 2897.1363 2912.7778 2985.8030 3031.0426 3040.4420 3111.7683 3120.5867 3129.7671 3142.8899 3153.3416 3160.9341 3168.3306 3170.0455 3178.8032 3190.0167 3262.7846 3471.2157 3580.5225
redmass: 4.5056 4.0327 4.5351 3.6581 4.1818 2.9943 2.6723 3.9318 4.1675 4.0025 2.8950 3.0677 3.9838 3.7011 2.8451 4.0582 3.0262 3.4890 3.2617 5.8358 3.4971 5.2024 4.1044 5.5789 2.8997 1.4888 1.1642 2.0124 4.2646 1.9810 2.7215 3.6480 1.2936 1.4640 3.0763 1.4953 1.2454 1.4069 5.2521 1.3430 2.4578 1.3624 1.3905 2.0611 4.3837 1.3409 1.3392 2.1230 2.2065 3.9485 3.9692 1.5601 2.1578 1.6743 3.5063 1.3251 1.2254 1.0605 1.1237 1.1069 2.5076 1.3673 2.5269 1.4136 1.5323 1.7289 1.3826 1.3546 1.3170 1.5987 1.8628 2.9379 2.9865 5.1564 2.1021 1.5052 1.4437 1.3323 1.2793 1.5665 1.2029 2.4401 4.3247 6.0954 6.7580 6.3960 7.0660 1.0697 1.0667 1.0936 1.0857 1.0652 1.1064 1.0886 1.0862 1.0910 1.0961 1.0879 1.0910 1.1015 1.0970 1.1009 1.1024 1.0754 1.0834
irintensity: 0.5813 0.7751 0.3501 1.0040 6.5919 1.2677 3.1062 0.4086 13.4362 3.7732 1.0086 2.4438 4.1168 6.7832 0.5808 0.9948 15.3287 2.6331 18.5389 0.4290 2.4769 2.0238 7.0331 5.0659 35.9249 65.4657 99.2206 40.5683 5.2901 54.6708 20.4566 4.7272 145.8005 2.8381 3.0957 3.3254 0.1273 0.3692 0.7742 7.2324 4.5364 2.2123 0.4115 13.3021 7.8807 0.0603 0.1539 3.8075 5.4051 28.4334 0.5205 14.6191 6.1874 11.4225 122.5263 7.5222 9.7434 0.2688 3.8826 1.4873 5.1058 26.0700 11.3890 18.0104 5.5364 1.0522 19.4958 1.1769 24.3787 22.1407 1.6942 2.0863 29.1843 10.8217 10.5455 42.4503 35.6032 12.2435 10.2432 19.8376 4.0207 5.7151 53.5914 1.0668 11.9625 4.1816 6.2894 81.2274 76.8111 27.2920 8.1013 12.9236 4.9877 9.3270 3.2222 8.3475 32.1106 0.2316 1.3005 16.4803 1.6791 0.6595 27.5039 9.5455 187.2194
temp: 298.150 k
press: 1.00000 atm
elementType: 7 7 7 6 6 6 6 6 6 6 6 6 6 6 6 6 6 6 6 1 1 1 1 1 1 1 1 1 1 1 1 1 1 1 1 1 1
symmnumber: 1
zpe: 812677.7 jmol-1
zpe.correction: 0.309533 hartree
zpe.thermalcorrener: 0.326046 hartree
zpe.thermalcorrenthalpy: 0.326990 hartree
zpe.thermalcorrgfe: 0.261490 hartree
zpe.sumelectzpe: -783.175044 hartree
zpe.sumelectthermal: -783.158531 hartree
zpe.sumelectthermalent: -783.157587 hartree
zpe.sumelectthermalfe: -783.223087 hartree
dipole: 12.6554 -3.0172 0.6515
dipole: 13.0264
quadrupole: -25.1080 -83.1017 -107.3932
quadrupole: -14.1793 6.2247 -2.8714
quadrupole: 46.7596 -11.2341 -35.5255 -14.1793 6.2247 -2.8714
hfenergy: -783.4845771 hartree
pointgroup: C01 [X(C16H18N3)]
dipole: 4.9552099 -1.2660855 0.3289835 debye
polarizability: 282.0773634|0.0147464|174.3466394|18.4534149|0.0263448|122.8169962 unknown
InChI: InChI=1S/C16H18N3/c1-2-6-14(7-3-1)12-17-10-11-19-13-18-15-8-4-5-9-16(15)19/h1-9,13,17-18H,10-12H2
charge 1 multiplicity 1
37 atoms
N  2.146564 -1.002089 -0.22017
N  4.016634 -1.918761 0.556995
N  -1.473219 0.062603 0.079004
C  0.713198 -0.815715 -0.572104
C  3.155625 -0.00573 -0.296597
C  -0.089778 -0.069277 0.533704
C  4.357031 -0.596028 0.198489
C  2.694839 -2.131377 0.297878
C  -2.537795 0.022744 1.119127
C  3.124415 1.325287 -0.761633
C  5.571358 0.117188 0.255566
C  -3.921748 0.127818 0.490749
C  4.337575 2.038671 -0.70718
C  5.536699 1.447165 -0.207172
C  -4.869213 1.049311 1.000079
C  -4.287471 -0.706975 -0.596797
C  -6.165032 1.132209 0.439772
C  -5.579059 -0.621901 -1.160699
C  -6.522649 0.297015 -0.64259
H  0.67004 -0.257875 -1.523746
H  0.255669 -1.803364 -0.743558
H  -0.079294 -0.677668 1.457593
H  0.414943 0.895018 0.778722
H  2.162374 -3.062708 0.469963
H  4.652549 -2.618571 0.942578
H  -1.624072 0.824003 -0.593735
H  -2.420122 0.829131 1.879168
H  -2.434187 -0.942054 1.656657
H  2.212867 1.789008 -1.148018
H  6.494874 -0.329341 0.634451
H  4.363677 3.074652 -1.057577
H  6.453365 2.043729 -0.184949
H  -4.597449 1.702767 1.83851
H  -3.554549 -1.416386 -0.997495
H  -6.889976 1.846664 0.844331
H  -5.853566 -1.27225 -1.998596
H  -7.525415 0.360685 -1.078521
