program: Gaussian 09
title: 000035764
version: EM64L-G09RevD.01
frameworkgroup: C1[X(C18H16O6)]
method: RPBEPBE
basis: SDD
operation: Freq
keyword: #pfreq=noraman
keyword: PBEPBE/SDD
title: #p freq=noraman PBEPBE/SDD
converged: YES YES NO NO
title: Mulliken charges:
elementType: O O O O O O C C C C C C C C C C C C C C C C C C H H H H H H H H H H H H H H H H
charge: -0.291266 -0.291253 -0.262863 -0.262867 -0.235518 -0.235527 0.351498 0.351576 0.320941 0.320935 -0.378229 -0.309398 -0.309381 -0.378238 -0.320721 -0.335377 -0.335366 -0.320726 0.219662 0.219625 -0.269097 -0.269056 -0.537435 -0.537427 0.261140 0.303103 0.303108 0.261144 0.257203 0.244472 0.244462 0.257205 0.286922 0.286912 0.223767 0.247433 0.223714 0.247435 0.223770 0.223716
chargesum: 0.00000
title: Mulliken charges with hydrogens summed into heavy atoms:
elementType: O O O O O O C C C C C C C C C C C C C C C C C C
charge: -0.291266 -0.291253 -0.262863 -0.262867 -0.235518 -0.235527 0.351498 0.351576 0.320941 0.320935 -0.117089 -0.006295 -0.006273 -0.117093 -0.063518 -0.090905 -0.090904 -0.063521 0.219662 0.219625 0.017825 0.017856 0.157480 0.157494
polarizability: 6.27040746e+02 -9.35571945e+00 2.03466768e+02 2.53448230e-02 -6.13523453e-02 9.35788801e+01
1716.lowfreq: -8.7014 -2.6806 -2.5505 0.0004 0.0011 0.0016 10.8562 17.7673 24.2868
frequency: 10.8561 17.7673 24.2868 34.3473 41.5675 62.5541 85.4471 95.8661 96.8036 138.1306 143.1369 152.9805 154.5370 203.6130 213.7191 218.9251 245.9467 247.1807 249.3134 297.1203 303.2529 320.7052 369.3874 377.9206 382.1639 417.5251 417.8470 443.4102 464.2459 517.4586 518.3215 518.7099 547.7909 599.6435 617.6065 620.3662 655.9714 703.6604 704.2387 715.3449 715.5380 723.9537 743.8012 792.2184 808.3863 811.7645 811.8250 834.6756 835.0147 911.7402 920.3743 952.4314 952.5178 962.0358 963.5947 963.6793 986.3779 986.5505 998.0959 998.2689 1003.6141 1086.4286 1107.5855 1110.4307 1113.3176 1113.3191 1117.1272 1145.6638 1148.1659 1157.9268 1158.5000 1180.2371 1182.8775 1234.0305 1234.9190 1271.0703 1285.6960 1294.2593 1294.2908 1376.9611 1377.1742 1424.1489 1424.4329 1437.0496 1437.1768 1467.7934 1467.7945 1471.1870 1471.4625 1486.1512 1486.8940 1584.2445 1584.3258 1605.0352 1609.2854 1617.0488 1617.8159 1644.4569 2962.2543 2962.3795 3051.1419 3051.2013 3128.1680 3128.2009 3159.7338 3159.7618 3161.1286 3161.1954 3165.2392 3169.5585 3180.4865 3180.5087 3210.5175 3210.5224
redmass: 7.0901 3.4604 6.2917 7.4667 5.5819 6.5592 5.9158 3.6659 4.4946 7.2355 5.2704 3.6231 5.2967 2.2911 1.6516 4.3291 1.6482 1.6687 4.7101 6.4773 9.8572 5.2998 6.0012 6.0482 6.8512 3.0802 3.1042 4.9698 4.1223 2.5125 2.4992 5.5974 5.4525 4.5151 7.4511 7.1589 7.8145 6.5072 10.6571 3.6816 3.7030 6.8499 7.7027 6.8850 6.7378 1.2619 1.2613 1.6419 1.6418 2.0768 8.7660 1.3352 1.3346 4.4803 1.3299 1.3301 8.7884 8.5857 2.6594 2.6243 1.0867 4.7978 1.4369 1.2963 1.2594 1.2593 1.9750 1.9747 1.7945 1.4857 1.5571 1.5044 1.4867 4.0342 4.1055 1.9539 1.5137 1.2798 1.2796 6.7257 6.6925 3.8941 3.9083 1.1815 1.1801 1.0495 1.0495 1.1126 1.1102 2.1871 2.1717 7.8843 7.8613 8.2041 8.8667 7.4661 7.4155 6.6936 1.0329 1.0330 1.1041 1.1041 1.0995 1.0995 1.0885 1.0885 1.0900 1.0900 1.0986 1.0868 1.0977 1.0977 1.0944 1.0944
irintensity: 0.6703 1.5055 0.4604 0.0000 0.0000 0.3072 0.0000 0.0002 13.2413 0.0001 1.5081 0.0037 10.4383 7.7624 0.0000 0.0000 6.0170 0.0006 0.3805 0.7765 0.0000 0.0000 65.5693 0.0000 0.0051 0.0001 0.4140 0.0000 8.3552 0.0004 39.2126 0.0037 43.6228 0.0000 2.4029 0.0000 6.8696 0.0025 13.0830 0.0001 0.0027 30.3520 0.0001 13.9402 0.0001 9.0173 0.5529 0.0706 195.2001 0.0001 157.7076 0.0137 5.5110 0.0000 2.6986 0.0048 116.7400 0.2387 0.0000 64.2097 61.2995 0.0024 249.9081 0.0002 0.1477 0.1938 469.2595 0.0031 38.5902 0.0028 55.8758 602.6128 0.0004 0.0326 251.6232 420.2347 0.0006 0.0913 2.4712 18.2428 0.0541 0.0021 1.4672 69.2934 0.0193 0.0201 28.4768 237.8345 0.0154 0.0032 299.4655 12.5716 1.0399 0.0192 316.3376 260.4908 0.5264 0.0000 168.2602 5.3783 40.4289 53.8895 44.3186 13.3155 14.2220 3.6486 11.9663 6.5396 0.0002 4.1924 9.1012 1.2337 10.8321 0.0358
temp: 298.150 k
press: 1.00000 atm
elementType: 8 8 8 8 8 8 6 6 6 6 6 6 6 6 6 6 6 6 6 6 6 6 6 6 1 1 1 1 1 1 1 1 1 1 1 1 1 1 1 1
symmnumber: 1
zpe: 786511.2 jmol-1
zpe.correction: 0.299566 hartree
zpe.thermalcorrener: 0.322355 hartree
zpe.thermalcorrenthalpy: 0.323299 hartree
zpe.thermalcorrgfe: 0.243420 hartree
zpe.sumelectzpe: -1145.089986 hartree
zpe.sumelectthermal: -1145.067197 hartree
zpe.sumelectthermalent: -1145.066253 hartree
zpe.sumelectthermalfe: -1145.146132 hartree
dipole: -0.0013 0.0008 0.0034
dipole: 0.0037
quadrupole: -78.3416 -131.6778 -143.8337
quadrupole: 23.3758 0.1038 -0.0091
quadrupole: 39.6094 -13.7267 -25.8827 23.3758 0.1038 -0.0091
hfenergy: -1145.389552 hartree
pointgroup: C01 [X(C18H16O6)]
dipole: 0.0004987 -0.0004037 0.0013164 debye
polarizability: 627.1891882|-4.8908939|202.8615218|1.043562|7.0389234|94.0356843 unknown
InChI: InChI=1S/C18H16O6/c1-21-13-3-7-15(8-4-13)23-17(19)11-12-18(20)24-16-9-5-14(22-2)6-10-16/h3-12H,1-2H3
charge 0 multiplicity 1
40 atoms
O  -2.900864 0.653482 0.032572
O  2.904718 -0.653711 -0.032004
O  -8.512806 0.209496 -0.008717
O  8.516729 -0.210801 0.006794
O  -2.088317 -1.564136 -0.105739
O  2.092545 1.56393 0.108094
C  -4.303442 0.388864 0.011603
C  4.307365 -0.389554 -0.011523
C  -7.111784 0.192224 -0.007465
C  7.115711 -0.193299 0.006475
C  -5.092594 1.563061 0.084198
C  4.91035 0.885509 0.074668
C  -4.906218 -0.886502 -0.071514
C  5.096258 -1.563626 -0.087755
C  -6.491378 1.466826 0.074737
C  6.321403 0.976834 0.083232
C  -6.317272 -0.977948 -0.080592
C  6.495082 -1.467551 -0.078825
C  -1.891485 -0.327489 -0.026413
C  1.895568 0.327327 0.027997
C  -0.579795 0.35543 0.021349
C  0.583778 -0.355413 -0.019742
C  -9.207413 -1.078568 -0.087115
C  9.211607 1.0769 0.088877
H  -4.59386 2.534483 0.147418
H  4.2975 1.785188 0.133587
H  -4.293107 -1.78617 -0.127841
H  4.597453 -2.534856 -0.153305
H  -7.122701 2.358064 0.130042
H  6.779939 1.967575 0.150582
H  -6.775614 -1.968944 -0.145586
H  7.126269 -2.358705 -0.136921
H  -0.570779 1.447865 0.090503
H  0.574715 -1.447849 -0.088976
H  -8.960018 -1.721777 0.779595
H  -10.278012 -0.828104 -0.06976
H  -8.963522 -1.610348 -1.027254
H  10.28215 0.826278 0.070516
H  8.964119 1.722724 -0.775854
H  8.968023 1.605894 1.030658
