program: Gaussian 09
title: 000035703
version: EM64L-G09RevD.01
frameworkgroup: C1[X(C11H10O3)]
method: RPBEPBE
basis: SDD
operation: Freq
keyword: #pfreq=noraman
keyword: PBEPBE/SDD
title: #p freq=noraman PBEPBE/SDD
converged: NO YES NO NO
title: Mulliken charges:
elementType: O O O C C C C C C C C C C C H H H H H H H H H H
charge: -0.254100 -0.256712 -0.197264 0.381697 0.190470 0.362040 -0.489098 -0.370510 -0.388003 -0.252264 -0.244915 -0.310785 0.117886 -0.683323 0.283678 0.240537 0.258126 0.244613 0.217624 0.217681 0.251938 0.213115 0.233858 0.233709
chargesum: 0.00000
title: Mulliken charges with hydrogens summed into heavy atoms:
elementType: O O O C C C C C C C C C C C
charge: -0.254100 -0.256712 -0.197264 0.381697 0.190470 0.362040 -0.205420 -0.129973 -0.129876 -0.007651 0.190390 -0.058847 0.117886 -0.002640
polarizability: 2.27434810e+02 1.23404285e+01 1.36438947e+02 -1.31743613e-01 6.61723675e-02 5.99156367e+01
1716.lowfreq: -6.4551 0.0007 0.0008 0.0009 6.4759 8.6543 56.8859 92.0456 111.9100
frequency: 56.8832 92.0456 111.9092 116.6408 137.6725 242.0389 253.1883 260.3963 277.1891 297.5461 406.1665 418.2197 437.9695 456.6328 478.9191 526.7180 599.3649 622.8722 666.3940 685.2907 710.7965 745.3618 769.6219 807.6887 823.3849 830.5386 845.9621 862.3297 881.3015 956.0972 970.8093 985.5291 1029.7071 1034.5883 1100.3255 1118.3304 1134.8352 1155.8686 1185.6041 1244.2649 1252.8376 1265.9871 1276.5483 1367.3042 1386.4331 1399.1652 1404.2233 1435.6443 1462.4082 1475.7968 1486.0374 1500.9514 1545.5986 1608.0907 1621.7584 1695.3795 2968.2284 2999.7072 3029.9121 3097.3497 3108.3943 3133.6516 3139.1155 3178.0973 3185.4260 3187.9312
redmass: 3.7232 3.8165 4.0582 2.6486 3.5363 1.2285 6.8754 4.9244 4.6763 4.4201 6.0657 3.6968 7.5577 2.8771 5.2540 5.2773 9.0479 4.4778 3.0349 5.8049 7.9008 3.4348 6.4934 1.4244 1.1641 4.8851 1.5888 1.5355 3.8609 1.3208 3.3497 1.3362 2.5830 3.3000 2.0709 2.2168 1.4393 1.3665 1.6779 1.7958 2.2843 1.1387 1.7882 1.3508 4.3020 1.6619 1.5264 5.6802 1.0394 1.1177 1.1647 2.4362 8.6959 6.9526 7.0654 10.8374 1.0555 1.0364 1.1079 1.0989 1.1016 1.0907 1.0898 1.0956 1.0917 1.0952
irintensity: 2.5348 5.0084 2.8084 1.9321 0.0518 0.1172 0.2705 0.4338 5.6672 0.6585 0.0654 0.4884 2.1014 6.7238 16.2730 11.6492 8.2684 5.5545 3.6768 4.8221 19.2572 4.1915 11.2703 0.4049 17.6552 23.1605 85.4005 37.7755 20.3557 0.1173 67.4269 0.3422 40.4005 78.2382 113.5196 18.4780 5.0696 9.4096 127.7699 89.3898 40.8978 0.0061 117.6535 31.2651 46.6393 33.6365 8.4003 11.0987 12.7430 28.3175 28.5435 22.6907 22.2295 10.2200 573.3170 477.1608 26.0271 23.6954 27.4911 24.4051 33.4514 8.5882 11.6973 4.5795 2.5957 2.3065
temp: 298.150 k
press: 1.00000 atm
elementType: 8 8 8 6 6 6 6 6 6 6 6 6 6 6 1 1 1 1 1 1 1 1 1 1
symmnumber: 1
zpe: 481789.9 jmol-1
zpe.correction: 0.183504 hartree
zpe.thermalcorrener: 0.195555 hartree
zpe.thermalcorrenthalpy: 0.196500 hartree
zpe.thermalcorrgfe: 0.145037 hartree
zpe.sumelectzpe: -649.835980 hartree
zpe.sumelectthermal: -649.823929 hartree
zpe.sumelectthermalent: -649.822985 hartree
zpe.sumelectthermalfe: -649.874447 hartree
dipole: 3.9506 3.2403 0.0146
dipole: 5.1095
quadrupole: -79.7577 -80.4464 -83.5662
quadrupole: -22.2922 0.0049 0.0181
quadrupole: 1.4991 0.8104 -2.3095 -22.2922 0.0049 0.0181
hfenergy: -650.0194841 hartree
pointgroup: C01 [X(C11H10O3)]
dipole: 1.591185 -1.2274458 -0.0499396 debye
dipolederiv: -2.0332937 -0.5228599 0.0594098 -0.7582335 -0.566123 0.0261402 0.0588792 0.0190625 -0.278663 -1.2430859 0.4528607 0.0301169 0.175456 -0.4382751 -0.0046412 0.0308263 -0.0127234 -0.2052647 -0.9760125 0.4081293 0.0180944 0.8803222 -1.0117643 -0.0244899 0.0157872 -0.0096513 -0.3365941 -0.8728949 0.0414463 0.0265186 -0.1706874 -0.3077065 0.006388 0.0266546 -0.0000827 -0.0151909 0.8479358 -0.1866185 -0.0214978 -0.0370207 0.4632453 -0.0000768 -0.021921 0.0043023 0.1394218 1.8349664 0.406573 -0.0571749 0.4111839 0.276564 -0.0127901 -0.0539471 -0.0126957 0.1154788 -0.7556175 0.0132391 0.0168057 0.2644681 -0.079146 -0.0090394 0.0145378 -0.0012052 -0.2293965 0.612867 -0.0633775 -0.0227299 -0.1840591 0.1860904 0.004495 -0.022408 0.000622 -0.131652 -0.5679475 -0.0856357 0.0127168 -0.5932051 -0.1069184 0.0181861 0.015541 0.0024399 -0.1879865 1.0792393 -0.1525883 -0.0345065 -0.098614 0.2719142 0.0018061 -0.0340264 0.0032248 -0.0650098 0.7028356 0.2346407 -0.0117941 0.8081619 0.6232699 -0.0275763 -0.0170873 -0.009647 0.3850703 -0.3099142 0.0445181 0.0032745 0.7881145 -0.573672 -0.0227905 0.0000684 0.0000355 -0.2031077 1.5082545 -0.5413444 -0.0354126 -1.118962 1.355821 0.0303409 -0.0328043 0.0122691 0.2763074 -0.1390295 -0.0362042 0.0069396 -0.0935574 0.0413529 0.0034032 0.0069535 0.001305 0.0538707 0.0937911 -0.0292022 0.0027908 -0.0651384 -0.0066389 0.0028719 0.0030646 0.0018221 0.1826235 0.0628265 -0.0812847 0.0031374 -0.0273848 -0.0744623 0.0017925 0.0027705 0.003409 0.1535175 0.0120707 0.0844776 0.0046166 0.0709698 0.0372992 -0.0016356 0.0049442 -0.002058 0.1746404 0.0795922 -0.0160494 0.0018469 -0.0914405 -0.0740357 0.0035841 0.0021442 0.0013281 0.1392424 -0.021978 0.0499578 -0.0950895 -0.1093835 -0.0492422 0.0608993 -0.0563306 0.0876482 -0.0722388 -0.0114392 0.0443565 0.0897353 -0.1133263 -0.0520478 -0.0547791 0.0539551 -0.0917448 -0.0810339 -0.0332942 -0.0355583 0.0066753 -0.0049555 0.0740342 0.000532 0.0066091 0.0014626 0.1824886 0.0075394 -0.0681371 0.0042083 -0.1204252 -0.1174963 0.0048884 0.0047113 0.0031602 0.1175296 0.057517 0.0223642 -0.0455081 0.0973228 0.0645585 0.0922598 -0.0783609 0.0845056 -0.0531464 0.0650716 0.0162968 0.0368264 0.0903942 0.0633789 -0.0997685 0.0694386 -0.0867888 -0.0609067 unknown
polarizability: 227.9338397|-9.5836469|135.7767379|-5.2134012|-0.0491402|60.0788165 unknown
InChI: InChI=1S/C11H10O3/c1-2-13-9-5-3-8-4-6-11(12)14-10(8)7-9/h3-7H,2H2,1H3
charge 0 multiplicity 1
24 atoms
O  3.083754 -0.199175 -0.172463
O  -1.560675 1.255356 -0.034483
O  -3.751042 1.993913 0.028562
C  -1.036893 -1.147245 -0.041286
C  -0.62543 0.218656 -0.058993
C  1.711651 -0.429376 -0.128663
C  0.733509 0.59125 -0.102387
C  -0.022247 -2.150209 -0.067987
C  1.330598 -1.805857 -0.110807
C  -2.451966 -1.42751 0.002286
C  3.55975 1.205126 -0.201622
C  -3.387058 -0.412994 0.026714
C  -3.008493 0.995938 0.010254
C  5.082778 1.152098 -0.258444
H  0.981067 1.654927 -0.114703
H  -0.316823 -3.205652 -0.054768
H  2.118388 -2.563529 -0.131819
H  -2.781847 -2.473164 0.016155
H  3.136656 1.711015 -1.092488
H  3.203944 1.726113 0.709618
H  -4.460574 -0.613844 0.059963
H  5.495152 2.176957 -0.27626
H  5.488745 0.627511 0.622983
H  5.422557 0.623097 -1.164862
