program: Gaussian 09
title: 000035709
version: EM64L-G09RevD.01
frameworkgroup: C1[X(C11H23NS2)]
method: RPBEPBE
basis: SDD
operation: Freq
keyword: #p
keyword: freq=noraman
keyword: PBEPBE/SDD
title: #p freq=noraman PBEPBE/SDD
converged: YES YES NO NO
title: Mulliken charges:
elementType: S S N C C C C C C C C C C C H H H H H H H H H H H H H H H H H H H H H H H
charge: 0.053924 0.064521 -0.099704 0.011856 -0.339460 -0.424657 -0.763201 -0.725608 -0.377930 -0.368292 -0.349879 -0.336264 -0.693534 -0.693874 0.241244 0.187521 0.190362 0.226464 0.218276 0.271822 0.287125 0.274722 0.277475 0.195249 0.210595 0.203100 0.200815 0.195027 0.192781 0.192714 0.193875 0.209157 0.212899 0.218529 0.211019 0.212601 0.218729
chargesum: 0.00000
title: Mulliken charges with hydrogens summed into heavy atoms:
elementType: S S N C C C C C C C C C C C
charge: 0.053924 0.064521 -0.099704 0.253100 0.038424 0.020083 -0.204254 -0.173411 0.027913 0.035624 0.037929 0.050325 -0.052948 -0.051525
polarizability: 1.93933881e+02 -1.26554870e-01 1.73453879e+02 -8.38672072e+00 6.76031399e+00 1.16348840e+02
1716.lowfreq: -15.4796 -14.5904 -6.5390 -0.0022 -0.0010 0.0022 13.4692 25.6079 38.6011
frequency: 11.2876 24.9481 38.5193 48.5702 64.9395 70.7160 82.7301 106.9223 128.3568 148.7233 158.2888 220.6383 227.2321 234.6489 239.2000 260.7786 293.5237 335.6117 357.6327 389.2631 403.1277 415.9080 477.7686 509.1827 539.5721 699.3231 705.0489 728.6573 737.9894 778.0034 797.4281 834.4979 842.7232 871.9075 898.1638 899.7374 920.9303 941.9025 980.1298 988.2489 1010.5951 1054.3004 1061.2001 1063.0892 1075.0548 1089.5148 1094.2200 1109.9215 1127.3638 1164.8064 1186.2320 1204.1079 1218.0268 1224.3780 1231.5282 1241.8947 1257.2704 1274.0558 1283.8263 1288.2378 1290.7413 1306.9883 1320.0098 1335.3954 1338.6787 1343.7862 1349.4706 1379.6386 1387.3159 1391.2816 1428.4506 1445.3126 1465.3952 1468.1242 1470.6394 1471.9290 1475.9776 1477.7060 1482.2142 1482.6957 1489.4227 1493.2756 2863.1585 2887.0526 2959.6276 2964.2560 2967.4414 2973.7740 2973.9991 2976.1056 2998.1480 3003.3521 3006.7194 3020.8657 3023.1861 3025.9336 3036.0415 3045.5934 3055.9773 3070.5899 3071.5300 3073.4290 3073.7874 3105.8245 3116.5639
redmass: 4.1442 3.4028 4.6007 1.7702 2.2150 2.4439 2.9871 2.4765 2.5699 2.5125 3.2763 1.8721 1.2339 1.6450 2.3944 3.8315 3.1658 3.3884 4.4964 3.5076 7.8915 2.4472 2.5545 3.9476 3.3160 5.2585 3.7112 1.1863 1.0946 1.1923 1.2063 4.4333 1.3327 2.4734 1.7630 1.6960 1.2317 1.2430 1.9050 3.4667 2.8853 2.4808 1.9477 2.3486 1.8876 1.6870 2.2431 2.3368 1.8793 2.3975 2.0797 1.4213 1.2049 1.3464 1.3154 1.3750 1.3002 1.3431 1.0877 1.1456 1.0966 1.1755 1.2747 1.3632 1.3731 1.5129 1.3891 1.3892 1.2116 1.2266 1.0817 1.0912 1.0698 1.0676 1.0667 1.0729 1.0428 1.0425 1.0662 1.0637 1.0877 1.0922 1.0715 1.0818 1.0586 1.0586 1.0595 1.0377 1.0383 1.0563 1.0977 1.0620 1.0971 1.0864 1.0943 1.0638 1.0576 1.1006 1.1025 1.1006 1.1008 1.0995 1.0993 1.1090 1.1084
irintensity: 0.2519 0.0611 0.2060 0.0390 0.2229 0.2334 0.3252 0.0751 0.3840 0.3524 2.3886 0.8124 0.1265 0.7717 0.0868 0.1373 3.7797 0.1866 0.4976 0.4664 0.7649 1.8859 3.8964 7.4548 2.4833 7.7783 7.7304 5.5223 7.9733 0.7580 0.3390 8.8562 3.7192 13.8187 13.8631 1.0320 4.7707 3.5540 7.6467 3.4524 11.1758 28.7667 9.8998 1.4339 8.9670 2.2768 9.3986 19.5669 14.7709 32.1271 9.6651 37.4541 7.2394 1.9253 2.0376 2.5433 2.7366 1.5625 5.9712 2.9633 1.8552 4.9309 8.4410 1.3497 0.6878 3.5414 15.7096 7.2148 10.5784 6.6880 5.9677 7.7054 1.3639 2.7475 4.1661 2.6991 12.2553 12.8138 2.8502 0.2465 40.1184 2.1646 60.1941 39.1457 6.8565 17.0320 43.9278 34.8584 28.9797 51.8323 3.6027 56.0659 4.4977 7.9813 13.1699 31.4130 10.9199 50.0108 47.1807 83.3133 93.8863 52.3853 49.6791 3.8384 14.0822
temp: 298.150 k
press: 1.00000 atm
elementType: 16 16 7 6 6 6 6 6 6 6 6 6 6 6 1 1 1 1 1 1 1 1 1 1 1 1 1 1 1 1 1 1 1 1 1 1 1
symmnumber: 1
zpe: 849706.4 jmol-1
zpe.correction: 0.323636 hartree
zpe.thermalcorrener: 0.341918 hartree
zpe.thermalcorrenthalpy: 0.342862 hartree
zpe.thermalcorrgfe: 0.273509 hartree
zpe.sumelectzpe: -1282.650857 hartree
zpe.sumelectthermal: -1282.632575 hartree
zpe.sumelectthermalent: -1282.631631 hartree
zpe.sumelectthermalfe: -1282.700984 hartree
dipole: -4.2533 0.7886 0.3385
dipole: 4.3390
quadrupole: -119.2004 -100.3527 -106.3014
quadrupole: 2.5552 2.1791 1.5988
quadrupole: -10.5822 8.2655 2.3167 2.5552 2.1791 1.5988
hfenergy: -1282.9744927 hartree
pointgroup: C01 [X(C11H23N1S2)]
dipole: -1.6098611 -0.5440604 -0.1627014 debye
polarizability: 193.3610392|2.7357974|173.3316397|7.960924|9.8084354|117.0439215 unknown
InChI: InChI=1S/C11H23NS2/c1-3-5-7-12(8-6-4-2)11-9-13-14-10-11/h11H,3-10H2,1-2H3
charge 0 multiplicity 1
37 atoms
S  4.225703 0.085775 0.126263
S  3.640573 2.299949 0.604653
N  0.080874 0.41007 -0.431113
C  1.454675 0.591688 0.122329
C  -0.949864 1.043163 0.44065
C  -0.283374 -0.962116 -0.88105
C  2.506172 -0.328575 -0.54172
C  1.925209 2.051602 -0.133586
C  -2.335497 1.17505 -0.224069
C  -0.481236 -2.037777 0.225032
C  -3.298585 2.043227 0.619302
C  -0.763076 -3.433325 -0.377767
C  -4.708655 2.143265 -0.000999
C  -0.997808 -4.51759 0.696128
H  1.492379 0.407859 1.22451
H  -1.057245 0.501478 1.414063
H  -0.601342 2.061472 0.693702
H  -1.214943 -0.882956 -1.471858
H  0.485715 -1.311773 -1.593314
H  2.507514 -0.194494 -1.6358
H  2.350655 -1.388479 -0.282764
H  1.281362 2.78853 0.37346
H  1.946932 2.252765 -1.216233
H  -2.795469 0.177413 -0.370661
H  -2.207189 1.622503 -1.229475
H  -1.32428 -1.751842 0.885647
H  0.418771 -2.091021 0.871811
H  -2.871176 3.060405 0.731948
H  -3.373222 1.621492 1.642804
H  0.087559 -3.731466 -1.025007
H  -1.6496 -3.371292 -1.042134
H  -5.175281 1.144093 -0.090152
H  -4.66534 2.584527 -1.014464
H  -5.37638 2.773824 0.614068
H  -1.864669 -4.262146 1.334125
H  -0.115425 -4.619987 1.355265
H  -1.194136 -5.504411 0.238206
