program: Gaussian 09
title: 000035818
version: EM64L-G09RevD.01
frameworkgroup: C1[X(C17H20N3O)]
method: RPBEPBE
basis: SDD
operation: Freq
keyword: #p
keyword: freq=noraman
keyword: PBEPBE/SDD
title: #p freq=noraman PBEPBE/SDD
converged: YES YES NO NO
title: Mulliken charges:
elementType: O N N N C C C C C C C C C C C C C C C C C H H H H H H H H H H H H H H H H H H H H
charge: -0.259161 -0.132049 -0.307269 -0.379791 -0.395660 0.288834 -0.368978 0.247309 -0.063530 -0.513916 -0.298726 -0.299321 0.435590 -0.201646 -0.183309 -0.339783 -0.448070 -0.345600 -0.343928 0.323053 -0.536647 0.257078 0.255162 0.227077 0.226856 0.311955 0.279522 0.373512 0.212759 0.227425 0.266989 0.269567 0.262120 0.265058 0.244334 0.232234 0.257082 0.249001 0.226343 0.254899 0.223626
chargesum: 1.00000
title: Mulliken charges with hydrogens summed into heavy atoms:
elementType: O N N N C C C C C C C C C C C C C C C C C
charge: -0.259161 -0.132049 -0.027748 -0.006279 0.116580 0.288834 0.084956 0.247309 0.248425 -0.073732 -0.031737 -0.029754 0.435590 0.060474 0.081748 -0.095449 -0.215836 -0.088519 -0.094927 0.323053 0.168221
polarizability: 3.40640154e+02 -3.14044057e+00 1.87314457e+02 1.95836553e+01 5.66888657e+00 1.31952802e+02
1716.lowfreq: -7.8862 -0.0006 0.0005 0.0006 3.3863 5.2646 14.4199 19.2466 26.9613
frequency: 14.1007 18.3895 26.7629 37.8285 57.4017 73.3430 89.2644 116.3920 159.1800 176.0223 203.3905 218.3284 231.5781 251.9048 276.8035 280.0202 337.4789 384.8938 404.3049 416.1136 419.1412 451.4007 467.7562 511.2427 535.3104 557.9081 568.0767 590.7519 621.2360 632.3992 637.3133 681.1651 712.2617 729.7454 741.1554 755.3244 760.8970 765.5311 786.6809 814.9713 823.9102 830.7316 839.1752 864.4759 877.1381 936.7858 954.7667 958.1138 965.6789 981.4122 987.5421 1002.5567 1003.1204 1012.1679 1028.3744 1059.2005 1099.6506 1112.8375 1113.0370 1122.8595 1144.0201 1156.4438 1156.7596 1167.3547 1179.8542 1183.5310 1216.9096 1222.3641 1234.1681 1238.8579 1266.3789 1279.3035 1291.0000 1301.0619 1311.1949 1335.8839 1353.4982 1371.3521 1395.3796 1406.7821 1421.6293 1422.4421 1437.7957 1452.7752 1455.7138 1462.6046 1469.1135 1471.6696 1480.4807 1488.9035 1491.8919 1504.7482 1536.0314 1583.5786 1615.3453 1625.5186 1629.2389 2897.7292 2910.6402 2967.1708 2981.3399 3030.6320 3040.3706 3058.3916 3112.0020 3121.1754 3134.4934 3137.0898 3160.8123 3165.1638 3168.4549 3170.3386 3179.0217 3189.9776 3262.7313 3473.0511 3580.7025
redmass: 4.0487 4.4722 4.6095 4.1306 4.4886 3.2709 2.8931 3.1072 4.3701 2.8042 2.8425 4.0974 1.2554 2.9672 3.5715 4.0510 3.3473 4.6388 4.5646 2.9605 2.9391 4.1449 3.5016 2.8230 5.7078 4.1050 3.5159 4.3913 2.2954 4.2368 1.9435 1.1635 3.1723 5.0461 4.0203 3.6893 3.7130 1.2925 1.4947 1.6806 1.9875 1.4588 1.8097 1.3990 5.2575 1.3474 2.5115 1.3599 1.3688 3.8735 2.2729 2.6705 1.3412 2.1275 4.1518 3.9535 2.1708 1.3354 1.2641 1.6669 3.6787 1.3232 1.3097 1.2013 1.1955 1.1209 1.9300 1.4704 2.5459 4.7419 1.4187 1.5582 1.7249 1.2687 1.3948 1.4057 1.6046 1.6957 2.5247 2.9970 3.5098 5.0463 1.1732 1.2157 1.7368 1.4147 1.0499 1.0741 1.1077 1.1118 2.4342 2.4304 4.3163 6.9154 7.0701 6.3864 7.0750 1.0694 1.0665 1.0329 1.0940 1.0863 1.0648 1.1043 1.1066 1.0898 1.0998 1.0888 1.0879 1.0938 1.0910 1.0960 1.0969 1.1009 1.1024 1.0756 1.0833
irintensity: 1.9010 1.1961 1.4486 1.9673 4.5129 1.6713 6.0742 1.8237 1.3493 3.5240 3.3892 12.8933 1.9156 0.6481 0.6968 6.2117 6.7783 5.6029 8.5365 1.3447 12.7469 3.5364 2.9872 27.6920 0.4728 9.7188 2.8678 6.8025 56.8911 2.9956 41.7047 100.0446 8.9654 6.3879 3.6734 5.1660 6.5829 146.3996 2.0670 34.2040 1.4328 4.4536 48.2950 0.3301 0.5923 6.5742 3.6085 2.2785 4.3907 71.1089 2.9482 10.2229 0.0780 3.8716 29.8985 0.6575 8.2667 19.3891 1.2086 7.6627 163.8210 3.4840 6.1791 7.2204 59.6501 7.0903 7.3607 8.9394 15.1115 226.0893 16.8386 6.4008 0.2682 20.4479 5.8232 27.2322 21.7884 8.4938 24.5214 31.3369 7.9429 11.2110 11.6830 89.5254 10.4777 10.5543 15.8930 52.2065 4.1328 25.8166 4.8750 91.5344 50.0751 14.6714 14.8069 84.8630 6.8877 79.8818 82.4161 63.1485 32.0483 8.2889 12.8797 43.2679 4.9656 16.0548 18.3297 12.4963 0.2835 12.0873 1.2550 3.1877 1.8109 0.7044 26.4352 12.8458 194.9695
temp: 298.150 k
press: 1.00000 atm
elementType: 8 7 7 7 6 6 6 6 6 6 6 6 6 6 6 6 6 6 6 6 6 1 1 1 1 1 1 1 1 1 1 1 1 1 1 1 1 1 1 1 1
symmnumber: 1
zpe: 894747.9 jmol-1
zpe.correction: 0.340791 hartree
zpe.thermalcorrener: 0.360001 hartree
zpe.thermalcorrenthalpy: 0.360946 hartree
zpe.thermalcorrgfe: 0.289480 hartree
zpe.sumelectzpe: -897.528105 hartree
zpe.sumelectthermal: -897.508895 hartree
zpe.sumelectthermalent: -897.507951 hartree
zpe.sumelectthermalfe: -897.579416 hartree
dipole: 15.5793 -1.8017 1.2904
dipole: 15.7361
quadrupole: 7.9809 -93.8026 -121.9579
quadrupole: -24.9081 -2.7738 -1.9313
quadrupole: 77.2407 -24.5427 -52.6980 -24.9081 -2.7738 -1.9313
hfenergy: -897.8688962 hartree
pointgroup: C01 [X(C17H20N3O1)]
dipole: 6.0941771 -0.8861078 0.6365259 debye
polarizability: 339.7534648|-7.1483407|188.1346395|22.6276222|1.1457283|132.0193092 unknown
InChI: InChI=1S/C17H20N3O/c1-21-15-8-6-14(7-9-15)12-18-10-11-20-13-19-16-4-2-3-5-17(16)20/h2-9,13,18-19H,10-12H2,1H3
charge 1 multiplicity 1
41 atoms
O  -6.957897 0.205557 -1.086639
N  2.982299 -0.992253 -0.28282
N  -0.644895 -0.005547 0.160472
N  4.886535 -1.916924 0.396371
C  1.537634 -0.810952 -0.589538
C  3.969376 0.028234 -0.313707
C  0.750263 -0.139126 0.574817
C  5.192465 -0.566699 0.118384
C  3.563686 -2.140426 0.150295
C  -1.690865 -0.15287 1.213126
C  3.90081 1.385769 -0.689567
C  6.392697 0.167856 0.198837
C  -3.082709 -0.021863 0.615706
C  5.099799 2.120609 -0.611695
C  6.320858 1.524141 -0.174649
C  -3.481004 -0.832305 -0.483306
C  -4.017695 0.893744 1.149296
C  -4.771493 -0.730158 -1.026494
C  -5.324247 1.007696 0.61998
C  -5.70234 0.190437 -0.474343
C  -7.973505 1.118456 -0.547271
H  1.461742 -0.202493 -1.507441
H  1.091284 -1.795357 -0.803647
H  0.792861 -0.796903 1.463294
H  1.246812 0.818178 0.860055
H  3.053565 -3.091934 0.272186
H  -0.830164 0.797454 -0.452399
H  5.544083 -2.626292 0.723629
H  -1.573207 0.59252 2.03314
H  -1.553934 -1.155442 1.668037
H  2.971662 1.853091 -1.026653
H  7.332878 -0.281946 0.529801
H  5.097335 3.177597 -0.89366
H  7.225263 2.137996 -0.13083
H  -2.766021 -1.542743 -0.913277
H  -3.732109 1.529607 1.996669
H  -5.09058 -1.350396 -1.869521
H  -6.023893 1.724079 1.060061
H  -8.201783 0.882586 0.509713
H  -8.865759 0.949712 -1.166586
H  -7.651506 2.173809 -0.635726
