program: Gaussian 09
title: 000035719
version: EM64L-G09RevD.01
frameworkgroup: C1[X(C13H19NO2)]
method: RPBEPBE
basis: SDD
operation: Freq
keyword: #p
keyword: freq=noraman
keyword: PBEPBE/SDD
title: #p freq=noraman PBEPBE/SDD
converged: YES YES NO NO
title: Mulliken charges:
elementType: O O N C C C C C C C C C C C C C H H H H H H H H H H H H H H H H H H H
charge: -0.250373 -0.252712 -0.607324 -0.035736 -0.412557 -0.296023 -0.710286 -0.709258 -0.346971 0.474727 0.240873 -0.420468 -0.394052 -0.222719 -0.221382 -0.244237 0.207146 0.215136 0.217442 0.241530 0.241317 0.216785 0.214999 0.211613 0.210607 0.215310 0.216256 0.249148 0.234748 0.251915 0.275320 0.309031 0.226163 0.225458 0.228573
chargesum: 0.00000
title: Mulliken charges with hydrogens summed into heavy atoms:
elementType: O O N C C C C C C C C C C C C C
charge: -0.250373 -0.252712 -0.022972 0.171411 0.020022 0.186824 -0.066889 -0.067086 -0.097823 0.474727 0.240873 -0.185720 -0.142137 0.003443 0.004076 -0.015664
polarizability: 1.61909320e+02 -1.78017322e+01 1.52134408e+02 9.30412518e+00 7.65821777e+00 1.36310065e+02
1716.lowfreq: -10.4877 -5.2532 -0.0007 -0.0002 0.0003 10.1889 15.1528 21.9523 25.8112
frequency: 13.3325 21.9132 25.6647 52.1411 78.1240 83.4211 101.9633 153.9565 173.2021 197.3198 217.1770 231.7181 248.9465 270.3639 287.7354 321.3307 345.6544 361.7076 378.3588 401.8324 430.1374 495.1987 528.1074 561.2003 606.2062 613.4629 662.6847 702.7444 713.1807 772.0259 778.4818 793.8604 822.5536 851.9986 865.5033 911.9659 914.2760 927.9294 953.3112 968.5183 975.8967 989.0192 989.6061 995.2898 1021.7621 1024.8790 1075.7635 1120.7056 1135.8864 1143.6833 1149.0577 1155.7908 1172.2618 1184.8830 1191.7779 1203.1208 1209.0457 1270.1259 1280.2998 1284.5201 1329.2888 1332.9391 1337.5262 1348.7023 1378.9832 1381.6423 1388.3939 1396.8400 1442.4294 1464.2255 1465.5435 1477.8771 1478.2840 1481.3659 1485.8829 1490.5733 1594.5269 1597.6230 1607.1313 1648.7249 2967.8563 2971.0800 2974.3368 2992.5391 3003.0186 3015.2890 3043.0223 3062.2577 3069.6945 3070.2969 3073.7943 3087.6046 3119.1557 3123.4026 3135.4757 3146.1750 3163.1081 3475.3834 3617.6538
redmass: 4.1520 3.6629 2.7974 4.6705 5.0995 4.2041 2.0129 3.8144 3.6187 3.6163 1.1327 1.0608 4.0293 2.6803 1.4767 4.0330 2.7374 2.1051 2.7946 2.7955 4.2265 3.7152 1.5999 2.0329 4.9467 6.2993 5.4977 2.2453 2.6729 2.3872 1.1537 2.8443 5.0114 1.2491 4.4591 1.2195 3.0657 1.8015 1.2721 2.0275 1.3935 1.7769 5.4820 1.3445 1.9509 2.2154 1.6982 1.9921 2.0917 2.2694 1.7643 2.9406 1.0601 1.1268 1.9413 2.5051 1.2840 1.3605 1.1382 1.5023 1.3754 1.4719 1.3115 1.4554 1.2077 1.5101 6.0010 1.2227 2.1293 1.0853 1.0450 2.1978 1.0568 1.0814 1.0525 1.0548 4.9019 2.0854 5.5988 2.0623 1.0803 1.0353 1.0360 1.0636 1.0847 1.0567 1.1021 1.0999 1.1002 1.0985 1.0989 1.1082 1.0855 1.0870 1.0915 1.0962 1.1015 1.0455 1.0986
irintensity: 0.1918 0.1295 0.0298 0.7192 0.3720 0.3269 0.4558 2.7812 4.3828 5.1339 0.0907 0.1824 1.9016 19.7784 23.9064 28.3993 2.1770 0.0849 1.0793 2.2298 4.9221 7.8874 204.5346 131.3148 60.4278 1.5464 2.8279 29.3706 39.0683 19.3823 2.8321 13.7540 4.4587 0.3465 10.5702 2.7757 35.0977 3.2105 0.0396 4.4101 0.1835 0.0355 0.6039 0.0373 8.2783 3.9749 18.5567 85.2795 111.1303 84.2595 5.9791 165.2590 2.0150 2.2361 6.4650 37.5845 5.3527 16.5270 1.1942 12.9229 21.4548 1.7500 2.3767 14.3293 21.8985 1.3131 0.3119 14.0729 11.8914 6.8835 1.2310 11.3712 3.5350 10.4159 11.1277 20.5667 46.5927 155.9107 5.3478 34.9634 17.0100 38.0440 17.6001 25.7933 25.6709 21.7894 7.5348 21.2475 9.7469 80.3336 84.9058 38.9013 5.0970 0.0477 10.5960 37.9777 25.2837 13.5263 15.4690
temp: 298.150 k
press: 1.00000 atm
elementType: 8 8 7 6 6 6 6 6 6 6 6 6 6 6 6 6 1 1 1 1 1 1 1 1 1 1 1 1 1 1 1 1 1 1 1
symmnumber: 1
zpe: 775492.6 jmol-1
zpe.correction: 0.295370 hartree
zpe.thermalcorrener: 0.312831 hartree
zpe.thermalcorrenthalpy: 0.313775 hartree
zpe.thermalcorrgfe: 0.246987 hartree
zpe.sumelectzpe: -710.753070 hartree
zpe.sumelectthermal: -710.735609 hartree
zpe.sumelectthermalent: -710.734665 hartree
zpe.sumelectthermalfe: -710.801452 hartree
dipole: -0.5219 -2.2001 -0.4506
dipole: 2.3056
quadrupole: -84.0488 -99.6067 -95.3783
quadrupole: -0.0523 3.0790 0.7569
quadrupole: 8.9625 -6.5955 -2.3670 -0.0523 3.0790 0.7569
hfenergy: -711.0484393 hartree
pointgroup: C01 [X(C13H19N1O2)]
dipole: 0.1774653 -0.8517804 0.256561 debye
polarizability: 161.1304326|18.9076671|150.4229464|9.4653531|-7.5615361|138.8004143 unknown
InChI: InChI=1S/C13H19NO2/c1-10(2)8-9-16-13(15)12(14)11-6-4-3-5-7-11/h3-7,10,12H,8-9,14H2,1-2H3
charge 0 multiplicity 1
35 atoms
O  0.852569 0.599426 0.548712
O  0.329035 1.837241 -1.355385
N  -1.963139 2.752881 -0.08445
C  4.384439 -0.944741 0.614712
C  2.929844 -0.558369 1.012086
C  2.209839 0.311512 -0.019738
C  4.438823 -1.799451 -0.675994
C  5.315628 0.288294 0.504061
C  -1.380417 1.49911 0.401641
C  -2.199306 0.224134 0.087209
C  0.006854 1.355979 -0.242433
C  -2.493761 -0.709568 1.109191
C  -2.680474 -0.011626 -1.225827
C  -3.262664 -1.862456 0.827761
C  -3.441753 -1.165749 -1.51031
C  -3.738051 -2.094034 -0.48319
H  4.766169 -1.574548 1.445365
H  2.94663 -0.015776 1.977066
H  2.335804 -1.479433 1.169813
H  2.714692 1.277294 -0.197616
H  2.071642 -0.196158 -0.990512
H  3.764206 -2.673357 -0.608169
H  5.463819 -2.174384 -0.852224
H  4.146122 -1.212025 -1.566587
H  5.044568 0.928213 -0.356814
H  6.365331 -0.02761 0.360178
H  5.270596 0.910327 1.417636
H  -1.225735 1.535343 1.496509
H  -2.120919 -0.533038 2.12569
H  -2.453051 0.708837 -2.020513
H  -2.972383 2.840653 0.045478
H  -1.623459 3.037794 -1.008013
H  -3.491882 -2.575213 1.628083
H  -3.805121 -1.343356 -2.529005
H  -4.334695 -2.986548 -0.703009
