program: Gaussian 09
title: 000035698
version: EM64L-G09RevD.01
frameworkgroup: C1[X(C9H14O2)]
method: RPBEPBE
basis: SDD
operation: Freq
keyword: #pfreq=noraman
keyword: PBEPBE/SDD
title: #p freq=noraman PBEPBE/SDD
converged: YES YES NO NO
title: Mulliken charges:
elementType: O O C C C C C C C C C H H H H H H H H H H H H H H
charge: -0.418069 -0.230647 -0.356431 -0.371431 -0.375102 -0.376246 -0.486865 -0.507341 0.172348 0.221330 -0.521405 0.185308 0.191915 0.223458 0.189061 0.216150 0.220754 0.209197 0.200471 0.252291 0.251365 0.226671 0.232763 0.375340 0.275114
chargesum: 0.00000
title: Mulliken charges with hydrogens summed into heavy atoms:
elementType: O O C C C C C C C C C
charge: -0.042729 -0.230647 0.020792 0.041088 0.061803 0.033422 0.016791 -0.047907 0.172348 0.221330 -0.246292
polarizability: 1.17990491e+02 7.12602869e+00 1.02415277e+02 -1.12653195e+00 -2.71813062e+00 7.67413886e+01
1716.lowfreq: 0.0005 0.0007 0.0008 4.8937 8.8726 15.8850 19.2715 37.8646 62.2162
frequency: 18.4850 37.8354 62.0704 63.7212 88.0145 123.0513 136.5620 180.2368 195.0061 237.0192 330.8859 333.2262 400.5275 482.0531 501.2709 545.8541 590.0984 633.8303 636.9968 640.8888 726.3910 747.7501 806.5646 841.4205 860.8538 876.8875 961.2143 995.3271 1024.8739 1048.0729 1070.5985 1083.7925 1096.6226 1103.6651 1130.2735 1195.7854 1223.0587 1236.0173 1261.9984 1273.3217 1290.6239 1297.5077 1305.2671 1320.3324 1346.4073 1365.4587 1374.7859 1437.3604 1457.2401 1462.4792 1465.0748 1473.6695 1485.9614 1668.8227 2136.6279 2952.1334 2965.6294 2972.2268 2979.8569 2985.9827 2994.9332 2997.6053 3018.3134 3025.9742 3031.1350 3049.9189 3063.9999 3427.1466 3512.5464
redmass: 7.7816 4.5957 2.3262 2.9496 3.3866 2.4338 1.9753 3.5171 2.8201 5.3016 3.0078 3.4502 4.0232 3.5967 1.7780 3.3582 4.4831 1.2315 1.3252 1.2197 1.0914 1.2484 1.5884 2.5099 3.8876 1.7374 1.4466 3.4253 3.5154 2.6154 2.6937 2.0727 2.5116 1.8774 1.2787 1.2415 1.3775 1.3677 1.3968 1.2407 1.0689 1.1238 1.3642 1.3314 1.5031 1.6072 1.8262 1.0850 1.0880 1.0805 1.0644 1.0934 1.0995 8.2058 6.0490 1.0590 1.0609 1.0593 1.0618 1.0613 1.0912 1.0652 1.0993 1.0996 1.0995 1.1043 1.1032 1.1581 1.0639
irintensity: 0.5907 0.0437 0.1508 0.1708 0.6747 0.0237 0.1251 1.2248 2.2999 0.1796 7.3154 3.4325 10.6522 24.3107 29.9855 0.8086 13.8051 77.6944 124.2717 82.9742 17.2264 0.2111 3.7934 0.6563 2.4251 2.1840 0.4673 67.8197 117.2313 44.6420 43.7543 0.4173 28.5304 3.6163 0.0379 13.5758 3.1105 2.6943 12.5556 5.6241 0.1560 2.7640 15.3085 4.4423 15.4947 4.7813 33.3144 27.5187 12.1916 2.4512 0.3566 0.5084 21.8010 207.4584 8.6563 17.3631 14.1237 29.5464 54.5699 5.4877 7.8502 39.5616 4.8029 19.5994 1.8477 45.7317 95.0714 60.1529 17.9218
temp: 298.150 k
press: 1.00000 atm
elementType: 8 8 6 6 6 6 6 6 6 6 6 1 1 1 1 1 1 1 1 1 1 1 1 1 1
symmnumber: 1
zpe: 548291.3 jmol-1
zpe.correction: 0.208833 hartree
zpe.thermalcorrener: 0.222053 hartree
zpe.thermalcorrenthalpy: 0.222997 hartree
zpe.thermalcorrgfe: 0.166541 hartree
zpe.sumelectzpe: -500.882635 hartree
zpe.sumelectthermal: -500.869414 hartree
zpe.sumelectthermalent: -500.868470 hartree
zpe.sumelectthermalfe: -500.924927 hartree
dipole: -0.1158 -2.0638 -0.4922
dipole: 2.1248
quadrupole: -65.7486 -67.7183 -67.3612
quadrupole: -0.0111 2.5721 -5.0543
quadrupole: 1.1941 -0.7756 -0.4186 -0.0111 2.5721 -5.0543
hfenergy: -501.0914677 hartree
pointgroup: C01 [X(C9H14O2)]
dipole: 0.0514678 0.8091547 -0.2036459 debye
dipolederiv: -1.1855549 -0.361264 0.3041577 -0.2934819 -0.4261481 0.0318979 0.2703883 0.0409655 -0.4895187 -0.6827242 0.1077 -0.0264427 -0.1015549 -0.7784742 0.3120981 0.1095593 0.2832567 -0.4936026 -0.0329888 0.0144287 0.0156813 0.034262 0.1478365 0.0473975 0.0065184 0.0340434 0.1583138 -0.0462897 0.010097 0.0172168 0.0275772 0.0382686 0.030568 0.011262 0.0564364 0.1541553 0.0291122 0.0071023 0.007671 -0.0086724 0.0689138 0.0432992 0.0257705 0.0483445 0.1274459 0.1017175 0.0717649 0.0238384 -0.0228672 0.1287585 0.0216794 0.0079751 -0.038508 0.1251305 -0.2126494 0.1104106 -0.0297957 0.2756927 -0.073344 0.1222196 -0.137704 0.1367663 0.0794645 0.0276258 -0.0214705 0.0191267 0.0078706 0.1183418 -0.0075981 0.0137621 0.0095618 0.1635094 1.5606836 0.0732838 -0.1959393 0.1173851 0.9798663 -0.5168649 -0.230832 -0.5059659 0.5282295 -0.0881223 0.0517113 0.0470479 0.1392358 0.1966172 0.1141424 0.1083441 0.1359439 -0.0274067 -0.4138908 -0.0504312 -0.0163261 -0.1366523 -0.4821413 -0.0324026 -0.0711037 -0.0642347 -0.3663494 0.0254779 -0.0338275 -0.0071269 -0.0396123 -0.1737858 -0.0578596 -0.0139173 -0.0809024 0.0401377 0.0384584 0.0059451 -0.0071552 0.0050122 0.0559936 0.0151929 0.0003608 0.0410564 -0.1896118 0.0725087 -0.0025184 0.0002217 -0.0239737 -0.1277319 -0.0498453 0.0000669 -0.068758 0.0451082 0.0344491 0.0118877 -0.0080033 0.0022538 0.0602804 0.018523 -0.0061922 0.0362955 -0.1868562 0.0496239 0.002355 0.0029527 -0.0104899 0.0717102 0.0097312 -0.0079333 0.0201469 -0.1481114 0.0497015 -0.0370422 -0.0094644 -0.0313808 -0.1123266 -0.0578924 0.0030424 -0.068271 0.0496535 0.0332999 0.0039519 0.0106949 0.0175279 0.0753004 0.0114108 -0.0062098 0.062331 -0.1639087 0.0033461 -0.0812404 -0.018635 -0.0266143 -0.1838357 -0.0725193 -0.0106077 -0.0928423 0.0472399 0.0645811 0.018837 -0.0076845 -0.0144243 0.1073593 0.0025031 0.0365169 0.0181193 -0.0897809 0.0531495 -0.0154932 -0.013403 -0.0651407 -0.0622091 -0.0459076 -0.0015477 -0.072314 0.0892697 0.0981235 -0.0401545 -0.0421361 -0.0551023 0.0276458 -0.0035813 0.0068499 -0.0251822 -0.1370973 -0.0918355 0.0755869 -0.0255101 0.0764099 -0.0677853 -0.0100232 -0.0452585 0.0145386 0.0982202 0.2396869 0.0888851 -0.0359996 0.1337722 0.2031641 0.0991001 -0.0653029 0.1035679 0.3329768 0.2725099 -0.0105056 -0.0049871 -0.0070323 0.2077255 -0.025269 -0.0038077 -0.0243955 0.2533889 unknown
polarizability: 118.0974639|7.0242185|102.3724731|1.0315799|2.38987|76.6772189 unknown
InChI: InChI=1S/C9H14O2/c1-2-3-4-5-6-7-8-9(10)11/h1,10H,3-8H2
charge 0 multiplicity 1
25 atoms
O  4.978598 0.268458 -0.451236
O  3.785666 -1.35746 0.698157
C  0.056652 0.88929 -0.202024
C  -1.288291 0.355421 0.339388
C  1.257303 0.007772 0.205815
C  -2.486594 1.244865 -0.055555
C  2.589293 0.552286 -0.343399
C  -3.851244 0.716976 0.47415
C  3.786519 -0.294509 0.03993
C  -4.231938 -0.596033 -0.082421
C  -4.553565 -1.68958 -0.55564
H  0.215637 1.925611 0.164474
H  0.002883 0.954687 -1.30915
H  -1.458185 -0.672523 -0.037541
H  -1.235949 0.279645 1.445609
H  1.315564 -0.06145 1.309028
H  1.105237 -1.026662 -0.156652
H  -2.537697 1.332355 -1.158449
H  -2.337032 2.268812 0.342591
H  2.565307 0.619723 -1.449419
H  2.776769 1.584964 0.011125
H  -3.809388 0.642985 1.579577
H  -4.647128 1.450305 0.236968
H  5.743781 -0.311578 -0.186782
H  -4.834299 -2.642359 -0.965542
