program: Gaussian 09
title: 000035747
version: EM64L-G09RevD.01
frameworkgroup: C1[X(C16H26N2O5)]
method: RPBEPBE
basis: SDD
operation: Freq
keyword: #p
keyword: freq=noraman
keyword: PBEPBE/SDD
title: #p freq=noraman PBEPBE/SDD
converged: YES YES NO NO
title: Mulliken charges:
elementType: O O O O O N N C C C C C C C C C C C C C C C C H H H H H H H H H H H H H H H H H H H H H H H H H H
charge: -0.213457 -0.218376 -0.229320 -0.248225 -0.247038 -0.209296 -0.218187 0.058196 -0.050466 -0.396910 -0.537348 0.183055 0.215336 -0.747872 -0.381954 0.249197 -0.050485 -0.239830 -0.238051 -0.696123 -0.585751 -0.496779 -0.496992 0.209536 0.247441 0.203241 0.220291 0.244439 0.221741 0.236456 0.229568 0.196901 0.198201 0.252442 0.230734 0.234449 0.232988 0.232888 0.215802 0.217884 0.212770 0.213741 0.224161 0.242724 0.208626 0.209568 0.242695 0.209256 0.208131
chargesum: 0.00000
title: Mulliken charges with hydrogens summed into heavy atoms:
elementType: O O O O O N N C C C C C C C C C C C C C C C C
charge: -0.213457 -0.218376 -0.229320 -0.248225 -0.247038 -0.209296 -0.218187 0.058196 0.159070 0.053773 -0.072619 0.183055 0.215336 -0.060106 0.013149 0.249197 0.201957 0.225353 0.227825 -0.049667 -0.147848 0.164139 0.163090
polarizability: 2.21156395e+02 2.59968132e+00 2.03305269e+02 6.28829628e+00 5.08992520e+00 1.86814473e+02
1716.lowfreq: -10.5876 0.0004 0.0006 0.0006 0.1645 4.3721 20.4518 22.5252 29.6656
frequency: 20.3944 22.1657 29.6488 32.1632 46.0112 51.4557 59.7313 66.0330 70.2797 88.7629 98.4740 103.6201 123.8065 137.9379 143.8016 163.5664 187.0174 193.0401 204.6500 208.5673 212.5138 231.6635 248.9042 279.1518 284.4889 288.6440 318.0793 332.8752 364.3057 372.0537 383.0947 384.7013 394.8184 407.8651 436.8335 444.8397 472.1291 536.9820 559.2089 605.6761 629.7300 686.5052 691.7205 708.7199 727.1881 741.0250 745.7926 845.6547 851.9601 871.8830 890.8346 893.7734 895.5711 903.2789 932.1133 948.4071 948.7469 971.2790 995.4755 1002.8000 1014.4565 1028.0819 1034.4686 1044.6890 1048.0776 1053.5838 1067.1455 1094.2573 1114.0102 1114.7460 1123.0270 1151.6850 1155.5145 1157.7160 1168.3737 1170.1935 1176.6270 1200.1555 1238.3565 1264.6112 1267.6750 1280.9477 1285.6874 1297.6828 1301.6539 1310.2055 1319.3576 1325.7037 1341.5382 1343.7164 1353.9846 1390.1478 1398.3247 1400.4618 1404.3895 1423.4722 1436.1575 1437.9817 1448.4881 1451.0951 1451.4404 1460.7595 1461.4196 1466.6184 1469.6011 1475.6061 1475.8765 1476.2327 1478.5401 1481.8372 1490.1807 1600.4506 1606.6124 1659.0638 1662.2548 2933.2643 2934.1874 2955.6035 2965.0244 2974.7094 2982.1547 2990.4586 2990.8267 2996.5338 3009.6901 3010.1485 3010.4024 3015.7498 3047.0578 3050.7618 3051.1776 3072.1094 3074.4630 3086.2076 3087.2775 3090.6518 3095.8853 3115.8909 3116.5633 3116.7354 3199.2332
redmass: 3.2506 3.4682 4.0826 3.9988 3.5449 4.3257 2.3156 2.1065 3.2346 2.6752 3.1503 3.2553 3.0569 4.8241 7.7959 2.6598 3.5382 3.2930 1.3085 1.2687 1.2653 1.2404 2.9780 3.4889 3.4077 3.2840 3.0586 2.4198 3.2734 5.0073 2.9869 4.9452 3.1713 3.7506 2.5228 8.1168 2.7216 4.0959 7.2015 4.8245 2.7604 5.0840 5.5843 4.5510 4.6555 1.1257 6.1864 2.2876 1.6217 1.8239 3.1102 4.1072 4.2027 2.9272 2.0079 1.4866 1.7120 2.4300 1.9532 1.4828 1.1759 2.6111 3.1016 8.3943 4.6812 3.2927 2.4800 2.0753 1.3153 1.3092 2.2499 1.9484 1.5705 1.7660 2.0974 2.0350 2.3000 3.0092 1.3725 1.3756 2.2751 1.2768 1.2505 1.1912 1.5123 1.3227 1.3240 1.3128 3.2212 2.7986 1.5073 1.2094 1.2155 1.1942 1.2906 1.1526 1.1408 1.1571 1.1169 1.0912 1.0907 1.0501 1.0508 1.0640 1.0615 1.0429 1.0614 1.0626 1.0600 1.0482 1.0830 10.3645 11.3759 4.8965 8.9867 1.0342 1.0342 1.0819 1.0590 1.0365 1.0613 1.0538 1.0540 1.0362 1.1032 1.0989 1.1032 1.0607 1.1024 1.1098 1.1096 1.1008 1.0995 1.0916 1.0929 1.0722 1.0992 1.0953 1.0974 1.0973 1.1148
irintensity: 1.7831 0.5375 0.5723 1.6436 0.5905 3.5079 0.3044 0.6604 0.1159 4.2058 1.7594 4.8985 0.4974 0.8269 2.2480 0.5976 2.1648 5.3985 1.9490 1.4083 0.3215 0.2680 0.5322 3.3897 7.9243 5.8724 2.3874 3.1385 3.8114 16.2834 5.7109 13.8661 3.0280 0.3608 2.7179 0.1550 1.1811 20.4284 29.5148 2.1334 30.5031 4.0377 1.4538 12.9943 3.4650 7.5244 2.1324 5.0618 1.8950 5.5693 5.0494 13.1369 24.9661 19.1087 5.7016 76.3030 14.7588 6.8756 3.6570 4.5797 17.1539 87.2965 1.1034 173.7493 185.5005 58.7283 8.7892 17.9394 3.2793 1.7208 1.2185 49.1164 10.8220 2.7978 3.9181 4.8966 37.7558 3.3295 0.8283 27.6597 200.5144 2.8556 7.8157 1.1867 9.0417 3.4998 1.3808 5.0946 283.2956 284.1987 12.0947 10.5219 14.0849 27.4426 13.4005 6.6656 9.7607 19.8476 26.7829 50.8891 47.3822 10.6005 14.1906 4.4998 8.2239 12.9010 5.4012 14.1646 3.0418 3.3555 20.6507 202.5656 495.0936 13.3596 22.4780 99.4056 77.0341 9.8109 19.4554 32.9304 46.5292 19.6365 57.3701 17.8099 53.4731 10.4116 71.7182 15.7421 12.8856 4.5717 5.0352 66.0897 45.2480 7.1561 22.9534 11.1878 28.9076 7.6086 10.5925 32.6415 23.5585
temp: 298.150 k
press: 1.00000 atm
elementType: 8 8 8 8 8 7 7 6 6 6 6 6 6 6 6 6 6 6 6 6 6 6 6 1 1 1 1 1 1 1 1 1 1 1 1 1 1 1 1 1 1 1 1 1 1 1 1 1 1
symmnumber: 1
zpe: 1063600.5 jmol-1
zpe.correction: 0.405104 hartree
zpe.thermalcorrener: 0.431764 hartree
zpe.thermalcorrenthalpy: 0.432708 hartree
zpe.thermalcorrgfe: 0.345290 hartree
zpe.sumelectzpe: -1109.086454 hartree
zpe.sumelectthermal: -1109.059794 hartree
zpe.sumelectthermalent: -1109.058850 hartree
zpe.sumelectthermalfe: -1109.146267 hartree
dipole: 0.8832 0.0762 -3.2909
dipole: 3.4082
quadrupole: -129.3451 -127.7644 -142.1510
quadrupole: 2.3456 -1.3222 3.4408
quadrupole: 3.7417 5.3224 -9.0641 2.3456 -1.3222 3.4408
hfenergy: -1109.4915576 hartree
pointgroup: C01 [X(C16H26N2O5)]
dipole: -0.2533805 0.1460543 1.308625 debye
polarizability: 222.3086328|-0.4694824|201.7259231|4.2845021|-6.1727927|187.2415807 unknown
InChI: InChI=1S/C16H26N2O5/c1-6-8-12(3)16(9-7-2)13(19)17(10-22-4)15(21)18(11-23-5)14(16)20/h7,12H,2,6,8-11H2,1,3-5H3
charge 0 multiplicity 1
49 atoms
O  0.827249 -2.583358 -0.398269
O  -1.521207 1.471971 -1.101986
O  2.17214 1.33534 1.74682
O  3.716488 -1.047323 0.072114
O  1.262963 3.297318 -0.734561
N  1.488268 -0.652247 0.717892
N  0.318944 1.416532 0.319875
C  -0.790569 -0.742078 -0.331747
C  -1.714224 -1.018967 0.968761
C  -3.183782 -0.563461 0.740772
C  -1.421931 -1.339253 -1.627575
C  0.565237 -1.402643 -0.057946
C  -0.692615 0.784229 -0.454826
C  -1.656861 -2.495981 1.427472
C  -3.933906 -0.272625 2.063244
C  1.374678 0.738836 0.984306
C  -0.529613 -1.22494 -2.850187
C  2.738314 -1.296892 1.128685
C  0.367315 2.880987 0.342306
C  -5.403221 0.136374 1.822584
C  -0.791776 -0.425497 -3.913455
C  5.02937 -1.598965 0.413721
C  1.448997 4.749859 -0.746286
H  -1.290553 -0.393995 1.784814
H  -3.216083 0.349539 0.116979
H  -3.726755 -1.350924 0.180564
H  -1.638811 -2.40586 -1.434415
H  -2.372776 -0.814771 -1.814836
H  -2.374247 -2.649345 2.253054
H  -0.658595 -2.789807 1.79324
H  -1.928723 -3.186555 0.610162
H  -3.408649 0.539471 2.606931
H  -3.906633 -1.160565 2.725888
H  0.37335 -1.85116 -2.848623
H  2.543741 -2.381199 1.234224
H  3.069068 -0.842785 2.082381
H  0.762501 3.203721 1.324672
H  -0.6584 3.257036 0.167065
H  -5.464985 1.039421 1.186861
H  -5.920965 0.355838 2.774147
H  -5.961434 -0.670932 1.312358
H  -0.117569 -0.384291 -4.776679
H  -1.675616 0.223292 -3.939795
H  5.686948 -1.353846 -0.43359
H  4.98761 -2.701252 0.541102
H  5.433922 -1.13934 1.34013
H  2.139199 4.956449 -1.577779
H  1.89757 5.108861 0.20409
H  0.490729 5.282786 -0.92186
