program: Gaussian 09
title: 000035850
version: EM64L-G09RevD.01
frameworkgroup: C1[X(C20H19ClO5)]
method: RPBEPBE
basis: SDD
operation: Freq
keyword: #p
keyword: freq=noraman
keyword: PBEPBE/SDD
title: #p freq=noraman PBEPBE/SDD
converged: YES YES NO NO
title: Mulliken charges:
elementType: Cl O O O O O C C C C C C C C C C C C C C C C C C C C H H H H H H H H H H H H H H H H H H H
charge: -0.060528 -0.302338 -0.271695 -0.251974 -0.408637 -0.254959 -0.417070 -0.288001 -0.479031 0.278677 0.126576 -0.340891 -0.291381 0.089093 0.313709 -0.233862 -0.134315 -0.316101 0.206879 -0.255456 0.200480 -0.360882 -0.370414 -0.268148 -0.234633 -0.533810 0.216385 0.244483 0.226265 0.209807 0.285720 0.250120 0.252344 0.309434 0.255884 0.266609 0.302215 0.237161 0.241655 0.255517 0.227799 0.379091 0.222713 0.223715 0.251795
chargesum: 0.00000
title: Mulliken charges with hydrogens summed into heavy atoms:
elementType: Cl O O O O O C C C C C C C C C C C C C C C C C C C C
charge: -0.060528 -0.302338 -0.271695 -0.251974 -0.029546 -0.254959 0.043798 0.148071 0.056809 0.278677 0.126576 -0.088548 0.018053 0.089093 0.313709 0.022022 -0.134315 -0.049492 0.206879 0.046760 0.200480 -0.123721 -0.128759 -0.012631 -0.006834 0.164413
polarizability: 4.47204781e+02 -1.94923567e+00 2.66681938e+02 -1.14360870e+01 -2.70959888e+01 1.33887034e+02
1716.lowfreq: -5.0068 -3.4020 -1.3528 -0.0016 -0.0006 0.0013 14.1244 20.0679 24.3011
frequency: 13.7081 20.0580 24.2447 33.7045 38.6131 59.7008 68.3425 79.5026 84.9484 101.8228 105.3547 113.9328 129.7645 143.9890 161.9710 176.0420 188.1545 190.6878 240.3707 242.7319 244.4174 262.9847 306.6982 312.8375 334.4568 352.8658 377.6802 398.2617 425.3318 439.3551 460.2285 470.1330 487.4528 520.3345 524.8603 537.4411 548.8715 581.8449 585.8150 601.5716 640.3168 651.1812 665.0029 672.4954 728.6287 732.6113 757.6386 763.2248 768.0171 796.5922 804.0922 828.2661 856.9789 857.5464 889.6210 905.6940 919.7828 923.8062 933.9891 942.0321 946.2321 983.5867 987.3089 1030.4804 1032.4986 1040.2807 1045.8691 1048.0208 1086.0177 1096.3993 1100.5313 1107.1244 1112.6485 1129.1250 1150.6878 1175.0478 1179.6118 1185.4821 1203.6831 1210.1424 1220.8347 1231.6887 1253.6754 1256.9667 1286.1175 1290.9514 1295.2337 1321.6903 1332.3568 1361.3434 1378.4965 1380.4363 1383.8531 1390.4548 1429.9392 1446.9233 1448.5884 1456.4932 1464.2308 1465.4661 1469.1275 1481.8546 1483.1316 1508.0769 1570.3864 1576.5492 1595.3199 1603.5884 1620.3675 1657.2813 2960.1842 2963.9235 2995.9672 3007.7154 3027.0200 3054.4713 3057.1905 3080.0794 3129.9839 3135.1688 3139.1464 3149.9779 3159.8748 3163.7265 3164.4179 3176.0405 3179.4235 3186.8896 3510.8177
redmass: 5.4318 7.6190 8.0701 6.1003 5.7305 11.0852 3.5094 5.0473 4.4043 3.5146 4.1623 3.3704 8.7598 6.7958 5.0622 4.0762 3.2237 3.1774 2.5987 1.7546 3.1247 3.5218 3.1110 4.7018 6.5687 8.1963 7.9273 5.1167 3.5256 3.4814 4.3421 3.0965 6.3525 2.0009 3.4762 3.6003 4.6770 6.8564 5.0132 3.5702 6.9606 1.4989 5.0998 4.6514 3.4010 3.4678 2.5643 1.4386 2.8872 3.0407 1.6003 4.9918 2.5627 1.5452 4.3183 1.8619 3.8265 1.6392 1.9182 1.3821 1.4047 1.3495 8.0217 2.5656 1.2448 2.7780 2.1030 2.9036 1.9700 2.2042 2.3155 2.0849 1.2576 1.9150 1.3626 1.0947 1.2546 2.3973 2.2019 1.9194 1.2117 2.6152 1.4650 1.3811 1.1363 1.7927 1.4692 1.8065 1.7014 2.2611 4.2068 2.3114 2.0649 4.5037 1.4123 1.0945 1.7693 2.0579 1.1064 1.2929 1.0737 1.5667 1.2560 9.5629 8.1685 6.4926 6.8709 6.2074 5.3025 8.1495 1.0560 1.0328 1.0637 1.0664 1.1022 1.1042 1.0971 1.1002 1.0994 1.0869 1.0895 1.0888 1.0878 1.0916 1.0932 1.0998 1.0965 1.0900 1.0639
irintensity: 1.5092 2.2820 0.4241 0.8718 0.6491 3.3321 0.7578 0.1887 1.8905 4.6332 1.4554 0.0886 0.7578 1.8859 2.0630 0.6360 1.1701 2.9303 1.4648 2.4165 1.3165 4.0000 1.1796 4.2691 1.1200 4.4114 3.9161 0.2227 17.2389 0.8472 2.5605 12.3299 31.2994 30.5750 7.7478 2.9740 7.6106 46.8719 4.6841 49.4728 3.2544 120.6574 66.7245 2.2089 16.1566 8.1049 16.1252 80.0363 13.8153 3.0064 51.1125 12.5995 1.3260 0.5296 14.7968 23.5992 45.3737 1.5912 22.6460 1.0000 2.5117 1.9945 41.3386 15.9749 40.7720 47.7186 165.7139 41.4883 9.2024 16.5506 48.7433 53.7604 0.2257 104.0691 5.1983 27.9205 6.4733 246.9950 109.6522 57.5111 7.2203 224.6672 3.4633 96.9606 1.7194 6.2200 122.8137 41.2854 46.9392 1.9807 11.5980 16.1101 44.2835 244.0641 26.3965 16.0778 14.5145 172.4177 18.2643 62.8984 19.1835 4.3790 5.3840 355.6291 13.9493 6.4218 96.8392 41.7831 321.7560 207.1972 49.7407 84.3002 7.6557 11.0450 42.4396 43.9040 1.5084 31.9853 17.3914 3.4003 0.8192 7.2485 4.0754 10.7486 24.6267 13.5916 10.5952 18.1735 25.7838
temp: 298.150 k
press: 1.00000 atm
elementType: 17 8 8 8 8 8 6 6 6 6 6 6 6 6 6 6 6 6 6 6 6 6 6 6 6 6 1 1 1 1 1 1 1 1 1 1 1 1 1 1 1 1 1 1 1
symmnumber: 1
zpe: 901881.6 jmol-1
zpe.correction: 0.343509 hartree
zpe.thermalcorrener: 0.368964 hartree
zpe.thermalcorrenthalpy: 0.369908 hartree
zpe.thermalcorrgfe: 0.283992 hartree
zpe.sumelectzpe: -1607.802524 hartree
zpe.sumelectthermal: -1607.777069 hartree
zpe.sumelectthermalent: -1607.776125 hartree
zpe.sumelectthermalfe: -1607.862041 hartree
dipole: 4.4549 4.6981 -0.2691
dipole: 6.4800
quadrupole: -139.7028 -140.4312 -164.2421
quadrupole: -30.2756 9.0966 0.9816
quadrupole: 8.4226 7.6942 -16.1167 -30.2756 9.0966 0.9816
hfenergy: -1608.1460329 hartree
pointgroup: C01 [X(C20H19Cl1O5)]
dipole: -1.9283956 1.5533788 0.60653 debye
polarizability: 443.975928|26.197518|245.5105758|-15.721345|56.8454056|158.2872492 unknown
InChI: InChI=1S/C20H19ClO5/c1-25-18-6-3-2-5-14(18)8-10-17(22)16-13-15(21)9-11-19(16)26-12-4-7-20(23)24/h2-3,5-6,8-11,13,23H,4,7,12H2,1H3
charge 0 multiplicity 1
45 atoms
Cl 6.902075 -0.86304 -0.733503
O  1.56084 1.665301 0.527958
O  -2.689863 -3.371631 -1.474251
O  1.873075 -2.038035 -1.589597
O  -2.837207 4.168129 -0.915159
O  -2.877339 3.143178 1.165468
C  0.038405 3.360399 1.326742
C  1.515715 3.007893 1.143064
C  -0.721581 3.453597 -0.012712
C  2.809754 1.082561 0.258204
C  2.838099 -0.202663 -0.37672
C  4.022223 1.74718 0.581798
C  4.109367 -0.764985 -0.67472
C  1.652463 -1.056133 -0.800933
C  -2.164211 -1.372591 -0.251625
C  5.269384 1.160854 0.288554
C  5.29275 -0.096037 -0.343614
C  0.29704 -0.777217 -0.280814
C  -2.220268 3.557043 0.182653
C  -0.77355 -1.545777 -0.673075
C  -3.15854 -2.317582 -0.682405
C  -2.60085 -0.284919 0.557237
C  -4.516088 -2.1666 -0.309447
C  -3.948464 -0.123794 0.927425
C  -4.90544 -1.071453 0.492634
C  -3.654297 -4.36586 -1.951399
H  -0.022566 4.32597 1.864582
H  -0.443649 2.606929 1.975009
H  2.033279 2.984817 2.122832
H  2.029577 3.733089 0.4787
H  -0.529048 2.540046 -0.610254
H  -0.379606 4.305268 -0.626773
H  4.009851 2.728243 1.062908
H  4.113694 -1.735701 -1.17982
H  6.199109 1.676625 0.545395
H  0.193847 0.050147 0.422479
H  -0.57076 -2.366909 -1.371595
H  -1.86879 0.45472 0.896368
H  -5.268835 -2.889553 -0.636383
H  -4.243381 0.736464 1.535565
H  -5.958298 -0.959388 0.775006
H  -3.824357 4.166482 -0.781321
H  -4.429283 -3.899614 -2.589892
H  -4.134096 -4.896228 -1.106471
H  -3.059578 -5.074625 -2.545397
