program: Gaussian 09
title: 000035702
version: EM64L-G09RevD.01
frameworkgroup: C1[X(C17H12)]
method: RPBEPBE
basis: SDD
operation: Freq
keyword: #p
keyword: freq=noraman
keyword: PBEPBE/SDD
title: #p freq=noraman PBEPBE/SDD
converged: YES YES NO NO
title: Mulliken charges:
elementType: C C C C C C C C C C C C C C C C C H H H H H H H H H H H H
charge: -0.489490 0.259808 0.301243 0.232364 0.256814 0.562018 -0.551064 0.507578 -0.647871 -0.428344 -0.448475 -0.431605 -0.440279 -0.215969 -0.241426 -0.238001 -0.828818 0.250108 0.242435 0.248080 0.238563 0.250979 0.251267 0.220581 0.226284 0.226369 0.225465 0.230754 0.230632
chargesum: 0.00000
title: Mulliken charges with hydrogens summed into heavy atoms:
elementType: C C C C C C C C C C C C C C C C C
charge: -0.489490 0.259808 0.301243 0.232364 0.256814 0.562018 -0.300956 0.507578 -0.405436 -0.180263 -0.209912 -0.180626 -0.189012 0.004612 -0.015142 -0.011633 -0.141966
polarizability: 2.79463137e+02 6.44818367e+00 2.31700518e+02 3.53815838e-03 -5.19768074e-03 7.34753309e+01
1716.lowfreq: -9.7060 -0.0006 -0.0005 -0.0004 2.9087 7.7414 85.5524 92.3615 114.0619
frequency: 85.5504 92.3530 114.0609 147.5210 176.4675 224.6293 274.5119 275.3506 304.0850 368.0178 419.3589 434.6311 438.4240 488.0712 503.9221 521.2814 574.0993 586.7075 609.2875 635.4135 645.9478 654.3987 713.7410 756.3738 766.5495 785.4549 798.1319 831.6174 868.4531 884.6427 888.6883 920.2004 925.1063 926.9596 951.7384 971.7752 982.0946 984.5046 1001.9067 1020.7248 1034.6326 1051.7203 1076.8310 1113.4115 1150.7945 1167.0427 1174.2387 1193.0153 1228.6907 1244.2601 1288.0843 1300.5538 1341.3787 1373.8872 1397.3433 1399.0846 1426.4691 1435.7683 1438.5855 1460.6086 1468.9896 1474.3924 1488.9102 1491.7400 1581.2758 1615.2978 1617.1375 1618.2887 1633.1895 2973.5055 3050.1271 3084.6601 3119.9655 3122.0527 3122.6717 3124.9771 3130.7163 3135.3653 3142.5940 3155.1692 3161.4711
redmass: 1.1618 3.4167 3.4326 3.6350 4.0541 3.5679 3.3275 3.5816 4.3089 4.7236 5.6177 3.1891 3.8959 5.0938 3.3616 5.3083 5.5304 3.3404 7.4833 3.3091 6.3400 2.9171 5.2686 1.3700 1.6922 5.3076 2.1252 2.3052 6.3271 1.4480 1.7189 1.5487 5.0858 1.5337 1.4520 4.4692 1.3755 1.3386 1.5333 2.0986 2.3477 1.5795 2.4804 2.1579 1.8897 1.3916 1.1780 1.3825 1.5580 2.3157 1.8942 1.9592 3.5225 2.6151 1.2519 3.6741 3.6527 3.1662 2.8770 2.0872 1.0460 2.4472 3.6991 2.2538 6.3375 6.8431 8.0903 7.4792 7.4039 1.0374 1.0975 1.0986 1.0911 1.0857 1.0857 1.0916 1.0898 1.0921 1.0947 1.0983 1.1003
irintensity: 0.9317 3.0783 1.0927 1.1248 0.3086 0.3934 0.7103 0.1289 0.3642 0.1778 0.9750 1.1332 0.1462 0.8768 2.2747 2.5001 0.5518 1.5900 0.0446 19.7256 2.3875 0.2565 1.2802 27.4174 69.8249 0.6588 45.2451 3.8846 1.9054 2.4239 36.6590 1.4292 0.0644 1.8220 2.9397 0.4122 1.5029 0.0654 9.8957 4.1932 3.8658 14.2367 0.3193 1.6959 7.8660 1.7423 0.5219 2.5242 1.6042 2.4625 2.3992 2.2588 0.8355 2.1765 11.0015 6.7494 5.1913 8.8610 13.2621 0.1945 13.8565 5.4041 78.3368 12.8573 0.3350 0.5565 6.9689 0.5086 11.2703 43.1429 20.2871 16.3279 11.7037 3.2403 0.9809 15.9679 4.9212 13.4394 28.1416 45.8020 40.1110
temp: 298.150 k
press: 1.00000 atm
elementType: 6 6 6 6 6 6 6 6 6 6 6 6 6 6 6 6 6 1 1 1 1 1 1 1 1 1 1 1 1
symmnumber: 1
zpe: 605081.0 jmol-1
zpe.correction: 0.230463 hartree
zpe.thermalcorrener: 0.242771 hartree
zpe.thermalcorrenthalpy: 0.243715 hartree
zpe.thermalcorrgfe: 0.192181 hartree
zpe.sumelectzpe: -653.913120 hartree
zpe.sumelectthermal: -653.900812 hartree
zpe.sumelectthermalent: -653.899868 hartree
zpe.sumelectthermalfe: -653.951402 hartree
dipole: 0.7440 -0.3487 -0.0001
dipole: 0.8216
quadrupole: -83.6022 -82.9546 -105.9281
quadrupole: -1.6763 0.0020 -0.0006
quadrupole: 7.2261 7.8737 -15.0998 -1.6763 0.0020 -0.0006
hfenergy: -654.1435829 hartree
pointgroup: C01 [X(C17H12)]
dipole: 0.2847081 0.1530608 -0.0004453 debye
polarizability: 280.0169999|-3.7755758|231.1229574|-1.4335606|1.4980293|73.4990279 unknown
InChI: InChI=1S/C17H12/c1-11-9-12-5-4-8-15-13-6-2-3-7-14(13)16(10-11)17(12)15/h2-10H,1H3
charge 0 multiplicity 1
29 atoms
C  0.640976 -0.419233 -0.009225
C  0.173333 0.934264 0.006472
C  -0.445861 -1.350301 -0.010743
C  -1.309178 0.858538 0.01582
C  -1.687032 -0.536409 0.005272
C  2.009759 -0.78055 -0.021588
C  1.11718 1.963156 0.009716
C  2.526834 1.64186 -0.002575
C  2.957629 0.301582 -0.017862
C  -0.14623 -2.717431 -0.025617
C  2.291663 -2.190628 -0.036506
C  -2.295732 1.861632 0.032158
C  -3.045126 -0.904063 0.011252
C  1.234771 -3.11766 -0.038359
C  -3.662277 1.48159 0.03804
C  -4.032474 0.114251 0.027697
C  3.533823 2.779725 0.001436
H  0.818292 3.018684 0.02154
H  4.032301 0.080903 -0.026995
H  -0.9292 -3.483835 -0.027696
H  3.329894 -2.543094 -0.04655
H  -2.020736 2.922234 0.04036
H  -3.343903 -1.958172 0.003421
H  1.467195 -4.188809 -0.04996
H  -4.440744 2.252529 0.050749
H  -5.093765 -0.158276 0.032526
H  4.571108 2.404326 -0.005342
H  3.405009 3.432235 -0.883037
H  3.412092 3.419852 0.895896
