program: Gaussian 09
title: 000035814
version: EM64L-G09RevD.01
frameworkgroup: C1[X(C14H22N3)]
method: RPBEPBE
basis: SDD
operation: Freq
keyword: #p
keyword: freq=noraman
keyword: PBEPBE/SDD
title: #p freq=noraman PBEPBE/SDD
converged: YES YES NO NO
title: Mulliken charges:
elementType: N N N C C C C C C C C C C C C C C H H H H H H H H H H H H H H H H H H H H H H
charge: -0.127829 -0.320723 -0.381561 -0.392428 -0.026267 -0.371653 -0.391877 -0.383860 0.291861 0.251417 -0.709492 -0.697463 -0.070880 -0.306710 -0.300204 -0.199007 -0.184246 0.189676 0.216860 0.196159 0.211128 0.206750 0.253436 0.265927 0.244547 0.205085 0.292818 0.204793 0.209817 0.229356 0.224086 0.209185 0.214747 0.310727 0.372271 0.268133 0.268797 0.261991 0.264634
chargesum: 1.00000
title: Mulliken charges with hydrogens summed into heavy atoms:
elementType: N N N C C C C C C C C C C C C C C
charge: -0.127829 -0.027905 -0.009290 0.014108 0.169892 0.046224 0.127486 0.065772 0.291861 0.251417 -0.065525 -0.049445 0.239847 -0.038578 -0.031408 0.062984 0.080388
polarizability: 2.70925708e+02 3.95732420e-01 1.72276069e+02 4.71619903e+00 6.57890320e+00 1.03694648e+02
1716.lowfreq: -12.8810 -0.0007 0.0001 0.0004 2.5819 8.6408 14.1072 23.6067 30.7915
frequency: 9.7457 22.8019 30.1504 49.7791 70.2403 92.5864 113.2634 139.2087 193.8516 211.1805 218.7393 238.2443 250.9098 272.9497 288.7515 343.4419 366.7728 401.0296 418.0081 427.2127 465.2542 466.6854 516.0903 544.0159 568.1877 591.3676 629.7404 674.8654 734.9266 755.4564 760.7617 765.9236 776.8054 788.8514 819.9636 822.6871 864.9055 876.1247 917.4525 936.3828 952.9987 958.1315 959.3812 980.1077 1003.6012 1007.0526 1012.4589 1051.1690 1061.7153 1094.7118 1116.9990 1143.6524 1149.1764 1155.5498 1175.3120 1180.5718 1185.8182 1202.1313 1219.3307 1232.8196 1261.8312 1275.0762 1281.3097 1283.8809 1298.4664 1313.0476 1329.6327 1335.6096 1353.4266 1362.1878 1366.8877 1381.9542 1400.7908 1406.3822 1422.7489 1454.6893 1456.8118 1460.3765 1462.2640 1467.4863 1472.3876 1475.4446 1484.3686 1490.7368 1491.7074 1496.2091 1533.5937 1615.0800 1629.5830 2883.7081 2887.7383 2956.1040 2959.0355 2970.2221 2975.0359 2993.2199 3031.5669 3038.1892 3049.5134 3060.8385 3069.9791 3073.7600 3080.0736 3120.5132 3160.0692 3167.2216 3177.6250 3189.2836 3264.0285 3526.0004 3582.6265
redmass: 3.1001 4.0468 3.7222 3.2593 4.0195 2.0074 2.8007 2.5284 3.5518 1.0707 4.0971 1.3415 1.9525 2.5723 2.8025 3.0030 3.0812 2.0930 2.9075 2.5721 2.4702 2.7264 2.0910 4.0188 3.4785 4.4169 3.9778 1.1674 4.3290 3.6148 3.8463 1.3078 1.2477 1.3964 1.5866 2.0990 1.4092 5.2894 1.1748 1.5704 1.4771 1.4484 2.1881 2.0522 1.3416 2.7437 2.1415 3.0216 3.0680 2.3336 1.7573 1.9430 1.7234 1.2805 1.8947 1.2190 2.3109 1.6142 1.4353 2.4564 1.3491 1.3618 1.4463 1.5497 1.2115 1.5086 1.4180 1.4261 1.5600 1.3788 1.3302 1.2126 1.2125 3.1034 4.7561 1.3976 1.5159 1.1267 1.2875 1.0565 1.1677 1.0521 1.0596 1.0512 2.3443 1.0807 4.0811 7.0692 7.1060 1.0698 1.0696 1.0629 1.0830 1.0365 1.0366 1.0868 1.1008 1.0889 1.0628 1.0996 1.0989 1.0993 1.0989 1.1067 1.0878 1.0910 1.0969 1.1009 1.1021 1.0768 1.0832
irintensity: 0.5499 0.1415 1.3412 0.2760 2.5882 1.0885 0.6468 0.5835 0.1238 0.0583 13.7324 0.5340 1.1011 0.7612 18.9136 14.0040 13.2581 28.1474 15.0227 15.3851 34.7507 17.6750 58.0501 6.8992 2.4736 4.7297 8.9969 95.9965 1.3629 8.3348 13.3632 140.1921 2.6331 3.9122 2.8279 2.8257 0.3147 0.5078 4.0085 12.9410 1.7691 2.1889 5.5800 19.4092 0.0243 7.3802 3.0281 13.7792 3.0956 4.1497 10.4158 31.7408 9.1087 7.3580 52.8901 16.3219 46.6557 29.4498 10.9566 14.8323 5.2485 5.9663 4.3833 1.4641 10.6544 2.8768 1.3302 6.4303 37.1306 27.6262 4.4827 17.2137 13.4949 46.3266 11.7257 12.4640 18.8207 14.3478 1.7578 1.8069 13.5752 8.2691 12.4635 27.0817 5.2264 9.5762 34.8087 16.9955 7.7403 35.6826 101.8185 33.1734 17.4232 28.1456 23.4531 26.5222 47.7995 10.9870 16.5517 37.4307 60.7819 28.8083 66.4332 4.4251 0.3096 1.1159 1.2478 1.0136 21.8261 23.9389 194.2904
temp: 298.150 k
press: 1.00000 atm
elementType: 7 7 7 6 6 6 6 6 6 6 6 6 6 6 6 6 6 1 1 1 1 1 1 1 1 1 1 1 1 1 1 1 1 1 1 1 1 1 1
symmnumber: 1
zpe: 894557.5 jmol-1
zpe.correction: 0.340719 hartree
zpe.thermalcorrener: 0.358297 hartree
zpe.thermalcorrenthalpy: 0.359242 hartree
zpe.thermalcorrgfe: 0.292075 hartree
zpe.sumelectzpe: -709.427201 hartree
zpe.sumelectthermal: -709.409623 hartree
zpe.sumelectthermalent: -709.408678 hartree
zpe.sumelectthermalfe: -709.475845 hartree
dipole: 9.2033 3.2859 0.9715
dipole: 9.8205
quadrupole: -34.2661 -74.8044 -103.0930
quadrupole: 9.1855 1.0112 2.2049
quadrupole: 36.4550 -4.0832 -32.3718 9.1855 1.0112 2.2049
hfenergy: -709.7679199 hartree
pointgroup: C01 [X(C14H22N3)]
dipole: 3.6424646 -0.9329966 -0.8887732 debye
polarizability: 271.0036293|2.1918263|151.4893368|-2.1764074|32.2213975|124.4034591 unknown
InChI: InChI=1S/C14H22N3/c1-12(2)7-8-15-9-10-17-11-16-13-5-3-4-6-14(13)17/h3-6,11-12,15-16H,7-10H2,1-2H3
charge 1 multiplicity 1
39 atoms
N  1.321019 -0.652166 -0.023573
N  -2.035454 1.101743 -0.032729
N  2.937463 -1.645872 -1.185056
C  -4.47937 0.69321 0.16886
C  -5.738224 -0.027713 -0.383927
C  -3.160874 0.267223 -0.506525
C  -0.033351 -0.256178 0.433348
C  -0.69999 0.799635 -0.513887
C  2.528268 0.033179 0.279441
C  3.565561 -0.609934 -0.460085
C  -5.677165 -1.559783 -0.169691
C  -7.012717 0.559458 0.267504
C  1.600434 -1.643961 -0.90924
C  2.795279 1.127606 1.127444
C  4.908119 -0.18813 -0.383695
C  4.136794 1.550499 1.204514
C  5.172461 0.905693 0.463858
H  -4.611932 1.787627 0.028802
H  -4.400382 0.519815 1.260476
H  -5.790989 0.16698 -1.476745
H  -2.945581 -0.791675 -0.262087
H  -3.276036 0.325446 -1.616505
H  -0.664171 -1.159447 0.484232
H  0.046124 0.155733 1.451253
H  -0.080623 1.715423 -0.522795
H  -0.693408 0.387742 -1.552245
H  -2.259514 2.09676 0.045808
H  -4.834199 -2.0284 -0.711239
H  -5.571858 -1.799821 0.906206
H  -6.605159 -2.039652 -0.529447
H  -7.922474 0.090466 -0.148615
H  -7.013225 0.382217 1.360086
H  -7.08797 1.650096 0.100611
H  0.873357 -2.338588 -1.320152
H  3.39978 -2.303969 -1.81392
H  2.010758 1.628223 1.701372
H  5.70777 -0.67777 -0.946427
H  4.393724 2.395268 1.850351
H  6.199153 1.271216 0.558619
