program: Gaussian 09
title: 000035701
version: EM64L-G09RevD.01
frameworkgroup: C1[X(C16H14)]
method: RPBEPBE
basis: SDD
operation: Freq
keyword: #p
keyword: freq=noraman
keyword: PBEPBE/SDD
title: #p freq=noraman PBEPBE/SDD
converged: YES YES NO NO
title: Mulliken charges:
elementType: C C C C C C C C C C C C C C C C H H H H H H H H H H H H H H
charge: 0.235955 0.253250 0.373018 0.160818 0.437185 -0.552228 -0.436379 -0.415032 -0.522658 -0.458249 -0.355669 -0.262411 -0.442562 -0.686714 -0.259787 -0.250249 0.210905 0.222766 0.238298 0.224656 0.233012 0.234322 0.221022 0.225030 0.240981 0.225695 0.216655 0.232904 0.226847 0.228618
chargesum: 0.00000
title: Mulliken charges with hydrogens summed into heavy atoms:
elementType: C C C C C C C C C C C C C C C C
charge: 0.235955 0.253250 0.373018 0.160818 0.437185 -0.118557 -0.198082 -0.190376 -0.289645 -0.223927 -0.134647 -0.037381 -0.201581 -0.011460 -0.032939 -0.021632
polarizability: 2.74700605e+02 1.16228250e+01 1.87605779e+02 -7.47480803e+00 5.86732011e+00 7.84259313e+01
1716.lowfreq: -11.4332 -0.0005 -0.0002 -0.0001 10.4821 13.8606 56.3643 92.5719 108.7203
frequency: 56.3024 92.5500 108.7163 137.8868 197.7146 226.8847 238.6159 243.4967 302.8191 346.9714 407.0924 417.1245 449.1347 487.6200 503.0140 510.3224 522.9303 574.8881 588.5061 627.4814 650.4322 706.9571 729.9326 762.2108 770.1896 788.2367 815.6422 824.3617 846.8614 851.3340 867.2604 887.4451 912.8194 954.5078 970.7546 977.8480 980.0018 991.2927 1029.5318 1039.7921 1060.0180 1069.5535 1102.7513 1139.8027 1170.8719 1177.5122 1188.6188 1233.8328 1236.8593 1245.7972 1253.7966 1273.1078 1310.0170 1318.9709 1389.0083 1390.8976 1398.6007 1404.5348 1422.6681 1450.4823 1454.6899 1472.3608 1484.8024 1497.3325 1507.3965 1530.2270 1582.0084 1606.2226 1618.1086 1628.7521 2982.5670 2991.1293 3038.6017 3079.2414 3086.9640 3119.1758 3120.4911 3123.5842 3132.2004 3139.8128 3150.0289 3160.5670 3161.9838 3168.2700
redmass: 3.8445 3.0503 3.6169 3.5539 1.4830 2.4776 2.4859 3.8618 3.2104 3.4710 3.0630 4.7015 4.0684 3.6790 3.1420 4.1611 4.8566 5.3983 2.9806 4.0556 5.1897 5.5525 2.0049 1.4356 1.5099 1.3505 3.5517 1.4836 2.6121 3.5837 4.2527 1.8901 1.4334 1.3802 2.6498 1.3727 1.3737 1.3601 2.5577 1.9113 2.1766 2.4438 1.6694 1.7000 1.3717 1.0828 1.3314 1.8767 1.6345 1.5811 1.4399 1.6132 1.7183 2.2367 1.2684 3.6093 3.1888 3.1362 2.3973 2.8251 2.5908 1.0425 1.0561 1.2437 2.4877 4.3850 7.4831 5.7385 6.4494 6.7470 1.0351 1.0603 1.1007 1.0998 1.1007 1.0872 1.0868 1.0876 1.0884 1.0913 1.0945 1.0949 1.0993 1.0964
irintensity: 0.3631 0.0377 0.9520 0.0193 0.7077 2.8347 0.4652 0.4799 2.6842 0.9855 4.9122 0.7229 0.1351 3.1849 5.2428 3.2351 0.3886 1.6626 0.9132 3.0238 2.2562 1.6087 2.5301 60.8974 32.7683 6.6166 3.7329 63.9188 13.2006 4.9250 4.3955 9.7971 0.6172 1.7554 2.5000 0.2151 3.2218 0.3276 0.0149 11.2680 14.2477 5.2736 2.7776 3.8210 0.1061 0.1527 0.9712 2.8363 3.9851 5.3535 6.1925 3.1446 1.6472 1.2651 11.1580 0.9010 2.3219 1.0317 7.2615 2.9922 14.8303 12.2296 0.4299 19.6114 2.9786 5.7852 2.2397 9.2110 0.1032 0.4312 40.6633 37.8498 9.7972 55.4700 39.2176 11.1378 1.1531 8.0060 8.9993 30.7555 8.1608 27.2428 35.2524 35.8786
temp: 298.150 k
press: 1.00000 atm
elementType: 6 6 6 6 6 6 6 6 6 6 6 6 6 6 6 6 1 1 1 1 1 1 1 1 1 1 1 1 1 1
symmnumber: 1
zpe: 648804.9 jmol-1
zpe.correction: 0.247117 hartree
zpe.thermalcorrener: 0.259645 hartree
zpe.thermalcorrenthalpy: 0.260589 hartree
zpe.thermalcorrgfe: 0.208523 hartree
zpe.sumelectzpe: -617.032472 hartree
zpe.sumelectthermal: -617.019945 hartree
zpe.sumelectthermalent: -617.019000 hartree
zpe.sumelectthermalfe: -617.071066 hartree
dipole: 0.4316 -0.2225 0.0572
dipole: 0.4889
quadrupole: -80.6081 -82.5981 -101.2087
quadrupole: -0.4776 -1.1998 1.7876
quadrupole: 7.5302 5.5402 -13.0704 -0.4776 -1.1998 1.7876
hfenergy: -617.2795892 hartree
pointgroup: C01 [X(C16H14)]
dipole: 0.1664584 0.0932679 -0.024297 debye
polarizability: 275.4171217|-8.20019|187.0833527|7.775763|3.6979777|78.2318412 unknown
InChI: InChI=1S/C16H14/c1-2-12-7-5-9-16-14-8-4-3-6-13(14)10-11-15(12)16/h3-11H,2H2,1H3
charge 0 multiplicity 1
30 atoms
C  1.088912 0.286711 0.188566
C  0.093719 -0.753241 0.050283
C  2.489112 -0.055323 0.262452
C  -1.327851 -0.392861 -0.020783
C  -1.708235 0.996303 0.047441
C  3.573165 1.011538 0.366539
C  0.65165 1.666597 0.25517
C  0.530018 -2.11187 -0.011716
C  -0.685403 2.006079 0.188621
C  2.862487 -1.408452 0.204085
C  -2.369955 -1.362994 -0.155035
C  1.889453 -2.434944 0.064667
C  -3.088368 1.362628 -0.020581
C  3.890335 1.686692 -0.996568
C  -3.718118 -0.984885 -0.220477
C  -4.085341 0.389962 -0.153261
H  3.292504 1.787995 1.103427
H  4.497995 0.54291 0.751382
H  1.400959 2.455928 0.366205
H  -0.198678 -2.920279 -0.119046
H  -0.995493 3.056491 0.243681
H  3.924395 -1.675308 0.267542
H  -2.123895 -2.427669 -0.208655
H  2.207116 -3.482504 0.019613
H  -3.354314 2.425162 0.033612
H  4.230286 0.935842 -1.732114
H  4.687497 2.44437 -0.883473
H  2.998638 2.184489 -1.417399
H  -4.494414 -1.751111 -0.323612
H  -5.140674 0.678845 -0.204965
