program: Gaussian 09
title: 000035684
version: EM64L-G09RevD.01
frameworkgroup: C1[X(C7H7ClO)]
method: RPBEPBE
basis: SDD
operation: Freq
keyword: #p
keyword: freq=noraman
keyword: PBEPBE/SDD
title: #p freq=noraman PBEPBE/SDD
converged: NO YES NO NO
title: Mulliken charges:
elementType: Cl O C C C C C C C H H H H H H H
charge: -0.101412 -0.427706 0.540770 -0.331192 -0.333445 -0.771993 -0.374962 -0.335220 0.289900 0.237291 0.239586 0.265760 0.266829 0.223571 0.255619 0.356604
chargesum: 0.00000
title: Mulliken charges with hydrogens summed into heavy atoms:
elementType: Cl O C C C C C C C
charge: -0.101412 -0.071102 0.540770 -0.093901 -0.093859 -0.239404 -0.151390 -0.079601 0.289900
polarizability: 1.32686802e+02 2.07294531e+00 8.26338523e+01 4.29257577e+00 2.65667014e-01 5.10925003e+01
1716.lowfreq: -11.6688 0.0014 0.0016 0.0027 4.4370 16.1004 52.3300 80.1982 188.4743
frequency: 52.3015 80.1975 188.4742 290.8669 343.3565 381.6448 402.1090 409.6276 465.1953 507.6798 600.3797 634.3487 725.5682 751.1924 808.9530 828.3776 841.8780 899.5361 936.8521 962.3614 1002.8925 1090.9993 1131.0633 1145.8962 1179.9389 1233.1263 1239.4830 1254.4940 1318.6202 1398.3619 1430.6511 1461.1995 1505.9937 1595.3285 1624.9912 3068.1977 3117.2430 3134.2063 3143.7588 3150.0930 3175.2202 3577.5313
redmass: 4.5441 9.5088 7.9594 2.5831 6.6098 1.1232 3.2849 2.9240 5.7278 3.5222 4.0200 6.6823 4.0697 4.4124 1.3449 4.3567 1.7355 1.5224 1.3695 1.3599 2.7801 1.3170 1.1237 1.3345 1.1052 2.0005 1.2421 3.5000 1.2941 6.0560 3.0381 1.1284 2.8321 6.4528 6.3726 1.0575 1.0880 1.0905 1.0967 1.1113 1.0957 1.0660
irintensity: 1.7557 1.2989 3.2365 2.9951 9.8179 147.5819 11.7178 0.3278 22.4515 35.1775 108.2933 0.6198 5.3807 2.3318 17.5792 26.5445 46.8600 1.0668 0.0794 0.1026 0.7895 32.1413 52.5638 211.2045 8.6333 7.4793 39.4542 66.2718 8.0048 14.1251 8.5412 5.8215 44.7043 22.7906 92.9827 23.6525 14.1732 10.7009 8.7235 8.8456 4.7568 48.3414
temp: 298.150 k
press: 1.00000 atm
elementType: 17 8 6 6 6 6 6 6 6 1 1 1 1 1 1 1
symmnumber: 1
zpe: 317549.9 jmol-1
zpe.correction: 0.120948 hartree
zpe.thermalcorrener: 0.129231 hartree
zpe.thermalcorrenthalpy: 0.130175 hartree
zpe.thermalcorrgfe: 0.086848 hartree
zpe.sumelectzpe: -805.569712 hartree
zpe.sumelectthermal: -805.561429 hartree
zpe.sumelectthermalent: -805.560485 hartree
zpe.sumelectthermalfe: -805.603812 hartree
dipole: -2.2750 -1.5880 1.6901
dipole: 3.2487
quadrupole: -62.7764 -51.8448 -61.8095
quadrupole: 7.2977 6.2677 1.0617
quadrupole: -3.9662 6.9654 -2.9992 7.2977 6.2677 1.0617
hfenergy: -805.69066 hartree
pointgroup: C01 [X(C7H7Cl1O1)]
dipole: 0.8437956 -0.634697 -0.7202588 debye
dipolederiv: -0.7934884 0.01029 0.1509823 0.0023182 -0.1903144 0.0002613 0.6110708 -0.0099269 -0.4362617 -1.5948877 0.0413591 -0.1339129 0.0265902 -0.0690776 -0.001027 -0.1975944 0.0027114 -0.447811 -0.4080024 0.0190308 0.0064049 -0.0103383 -0.1750503 -0.0041169 -0.22517 0.0084784 -0.1505312 0.2149402 -0.0610391 0.0372591 -0.0616405 0.1287767 0.0171115 0.0603417 -0.0267475 -0.1121062 0.2283776 0.0254937 0.0434581 0.0701387 0.1383522 -0.0153287 0.0661301 0.0179176 -0.1216376 1.1243813 -0.0179211 -0.2577143 -0.0072501 0.1679824 0.0018696 -0.5062295 0.0071078 0.555714 -0.4258431 -0.0052311 -0.0047645 -0.3637641 -0.0058475 -0.0315287 -0.0357813 -0.0022982 -0.1960522 -0.3756163 0.0332543 -0.0066389 0.3549886 0.0057392 0.0324053 -0.034423 0.0078834 -0.1642806 1.5062487 -0.0640347 0.1938045 -0.0379082 0.114811 -0.0100574 0.2469381 -0.0099308 0.1236611 0.0379209 -0.0937165 -0.0268712 -0.0772545 -0.0365428 -0.0113164 -0.0150583 -0.013626 0.1383513 0.0432372 0.0960309 -0.0256326 0.0740159 -0.0381496 0.0109539 -0.0138374 0.014748 0.1381931 -0.0044547 -0.0067504 0.0359291 -0.0830226 -0.0237415 -0.0977341 0.0502339 -0.0589855 -0.0280649 -0.0020095 0.0078421 0.0372149 0.081757 -0.0246048 0.0961308 0.0512269 0.0569633 -0.0267568 -0.0162654 0.1064514 -0.0279851 0.0968287 -0.0405103 0.0128632 -0.0363449 0.0170824 0.1701711 0.0455849 -0.0732163 -0.0187065 -0.0737087 -0.0059995 -0.0102816 -0.0256513 -0.0117124 0.1705593 0.4198767 -0.0178431 -0.0028269 0.0082499 0.0541766 0.0097953 0.0041484 0.000335 0.3868523 unknown
polarizability: 132.8563747|-2.5335466|82.6734681|-1.0957705|-0.2271273|50.883312 unknown
InChI: InChI=1S/C7H7ClO/c8-5-6-1-3-7(9)4-2-6/h1-4,9H,5H2
charge 0 multiplicity 1
16 atoms
Cl -3.465137 0.009026 1.004789
O  3.208283 0.046931 0.353239
C  -0.96805 -0.00424 -0.37505
C  -0.262125 -1.228595 -0.249564
C  -0.242298 1.211825 -0.24463
C  -2.438812 0.006244 -0.636294
C  1.126219 -1.247532 -0.00795
C  1.142908 1.212183 -0.003977
C  1.825981 -0.021822 0.11453
H  -0.806512 -2.17632 -0.335707
H  -0.773611 2.167238 -0.327686
H  -2.797903 -0.895421 -1.151668
H  -2.785056 0.915589 -1.146899
H  1.657971 -2.203199 0.084153
H  1.710576 2.141573 0.095603
H  3.600364 -0.85848 0.432711
