program: Gaussian 09
title: 000035694
version: EM64L-G09RevD.01
frameworkgroup: C1[X(C10H16N2)]
method: RPBEPBE
basis: SDD
operation: Freq
keyword: #pfreq=noraman
keyword: PBEPBE/SDD
title: #p freq=noraman PBEPBE/SDD
converged: YES YES NO NO
title: Mulliken charges:
elementType: N N C C C C C C C C C C H H H H H H H H H H H H H H H H
charge: -0.282663 -0.581957 0.216288 -0.572545 0.315935 0.322633 -0.363035 -0.434308 -0.435217 -0.839278 -0.845815 -0.236667 0.202526 0.239379 0.191626 0.236451 0.228244 0.227500 0.235801 0.232204 0.227593 0.231123 0.227810 0.230997 0.222686 0.241286 0.262880 0.298524
chargesum: 0.00000
title: Mulliken charges with hydrogens summed into heavy atoms:
elementType: N N C C C C C C C C C C
charge: -0.041376 -0.020553 0.216288 -0.130640 0.315935 0.322633 0.065042 -0.206064 -0.207718 -0.143680 -0.155885 -0.013982
polarizability: 1.51782753e+02 -9.33928641e-01 1.31553497e+02 1.11790428e+01 -1.19737769e-01 8.08412129e+01
1716.lowfreq: -22.2687 -11.7507 -11.3493 -0.0007 0.0002 0.0006 40.2359 64.2681 78.3660
frequency: 40.0906 64.2477 78.2655 123.3837 134.0331 138.6837 145.7555 223.6032 230.0799 280.3532 331.1192 339.6933 355.9094 406.8187 451.5828 461.3648 512.6883 519.1199 530.8619 556.2360 672.1634 713.2840 756.5833 777.3810 788.4658 824.5200 895.2073 897.6904 973.3427 986.1296 998.9785 1019.4948 1034.2791 1041.8170 1050.4612 1093.5821 1097.2376 1150.5182 1172.8628 1176.9747 1193.2834 1234.6070 1256.6005 1263.0506 1266.7697 1283.1044 1347.3824 1370.7429 1393.8783 1397.2086 1436.5645 1451.7441 1464.4384 1469.2859 1471.7985 1476.2798 1481.0094 1491.9103 1500.1208 1596.0880 1606.1612 1647.9265 2882.0909 2968.8299 2973.0086 2988.2939 3044.3214 3047.5703 3049.7613 3064.2196 3079.9382 3082.2613 3114.2901 3123.6895 3151.4549 3330.0273 3412.6709 3595.5590
redmass: 3.6657 3.8442 2.1955 2.1022 1.0590 1.2212 2.2657 2.7526 3.5368 3.1595 3.0464 2.1129 1.4767 1.4104 2.4945 2.2261 4.3735 3.0991 4.8398 3.3468 4.1690 1.5777 2.9292 1.2664 1.2047 4.0482 2.1277 1.3952 1.3398 1.5980 1.4995 2.7352 1.8539 1.5449 2.2429 1.8494 1.9341 2.5109 1.2221 1.2590 3.0727 1.6170 1.3995 3.0736 1.3050 1.3514 1.3688 5.1212 1.2610 1.2532 1.9701 1.9395 1.1239 1.0593 1.0633 1.3758 1.2167 1.0867 1.0935 7.2258 5.8780 1.0869 1.0720 1.0380 1.0381 1.0639 1.0965 1.0886 1.0958 1.0964 1.0980 1.0986 1.0854 1.0916 1.0994 1.0743 1.0472 1.0966
irintensity: 1.1942 0.0217 7.5667 5.0029 0.2664 0.5682 3.6202 0.1103 3.8793 3.8166 4.6585 4.2710 53.4817 184.9558 6.4389 31.2708 7.8828 0.0906 1.8743 5.4194 11.1175 60.9748 26.0194 50.5094 1.5818 1.8989 1.5801 0.0976 0.1820 4.7168 2.6335 13.3933 6.9957 1.2033 5.7499 14.0987 6.6130 3.2297 3.4238 2.1429 0.2911 1.6514 1.1973 1.3577 1.4719 1.7365 10.6229 0.9663 12.3938 12.6945 0.1020 1.5170 7.3298 25.7407 1.4381 29.1198 24.4007 9.9574 7.2619 6.9848 0.4536 5.2532 86.0935 37.6315 27.7727 36.7854 19.2557 14.2990 16.6841 45.6230 21.5345 21.2827 0.4055 33.3670 38.0216 23.1179 24.1644 3.3791
temp: 298.150 k
press: 1.00000 atm
elementType: 7 7 6 6 6 6 6 6 6 6 6 6 1 1 1 1 1 1 1 1 1 1 1 1 1 1 1 1
symmnumber: 1
zpe: 634336.6 jmol-1
zpe.correction: 0.241606 hartree
zpe.thermalcorrener: 0.254981 hartree
zpe.thermalcorrenthalpy: 0.255925 hartree
zpe.thermalcorrgfe: 0.201595 hartree
zpe.sumelectzpe: -499.202029 hartree
zpe.sumelectthermal: -499.188654 hartree
zpe.sumelectthermalent: -499.187710 hartree
zpe.sumelectthermalfe: -499.242040 hartree
dipole: 1.4719 1.4655 0.3818
dipole: 2.1119
quadrupole: -63.6170 -67.0908 -77.1090
quadrupole: 5.3604 1.9969 -0.2749
quadrupole: 5.6552 2.1815 -7.8367 5.3604 1.9969 -0.2749
hfenergy: -499.4436352 hartree
pointgroup: C01 [X(C10H16N2)]
dipole: 0.5741744 -0.5802195 -0.1549842 debye
polarizability: 151.9712535|0.8909772|131.5231325|-10.6084085|0.8136004|80.6830762 unknown
InChI: InChI=1S/C10H16N2/c1-8-4-3-5-9(2)10(8)6-7-12-11/h3-5,12H,6-7,11H2,1-2H3
charge 0 multiplicity 1
28 atoms
N  3.448078 -0.08271 -0.184531
N  4.437479 0.004228 0.833941
C  -0.389707 -0.028088 -0.374672
C  1.057612 -0.05839 -0.850139
C  -1.032013 1.22363 -0.12166
C  -1.099223 -1.246888 -0.143269
C  2.060879 -0.091161 0.33439
C  -2.36404 1.238079 0.361747
C  -2.430435 -1.198415 0.340095
C  -0.320652 2.545228 -0.37411
C  -0.461594 -2.60138 -0.419028
C  -3.064556 0.035784 0.594599
H  1.234192 -0.944649 -1.491281
H  1.297952 0.827726 -1.463506
H  1.843369 -0.974852 0.982744
H  1.943412 0.804028 0.968362
H  -2.852339 2.200822 0.55524
H  -2.97056 -2.136417 0.517196
H  0.641545 2.611226 0.166125
H  -0.095295 2.687892 -1.448741
H  -0.947053 3.394062 -0.050592
H  -0.241715 -2.738353 -1.495733
H  0.492111 -2.73062 0.125971
H  -1.135325 -3.419632 -0.11208
H  -4.093954 0.060318 0.969793
H  3.606264 -0.851527 -0.858777
H  4.714865 -0.858234 1.318475
H  5.196302 0.648294 0.611242
