program: Gaussian 09
title: 000000699
version: EM64L-G09RevD.01
frameworkgroup: C1[X(C18H22O5S)]
method: RPBEPBE
basis: SDD
operation: Freq
keyword: #p
keyword: freq=noraman
keyword: PBEPBE/SDD
title: #p freq=noraman PBEPBE/SDD
converged: NO YES NO NO
title: Mulliken charges:
elementType: S O O O O O C C C C C C C C C C C C C C C C C C H H H H H H H H H H H H H H H H H H H H H H
charge: 1.105543 -0.184930 -0.392876 -0.560875 -0.469367 -0.481802 -0.206603 0.260282 -0.112269 -0.206160 -0.478724 -0.502589 -0.485874 -0.503039 0.073366 -0.537162 -0.760235 0.273627 -0.577717 0.316540 -0.350213 -0.509359 -0.359813 0.284963 0.260875 0.230075 0.233001 0.234831 0.223929 0.221817 0.231449 0.201380 0.230480 0.218907 0.220505 0.248670 0.261116 0.229101 0.224454 0.239658 0.240443 0.238369 0.243634 0.271023 0.264798 0.396772
chargesum: 0.00000
title: Mulliken charges with hydrogens summed into heavy atoms:
elementType: S O O O O O C C C C C C C C C C C C C C C C C C
charge: 1.105543 -0.184930 -0.392876 -0.164103 -0.469367 -0.481802 0.054272 0.260282 0.117806 0.026841 -0.019964 -0.049323 -0.054014 -0.063628 0.073366 -0.027375 -0.067023 0.273627 -0.098906 0.316540 -0.106578 -0.238336 -0.095015 0.284963
polarizability: 4.29523117e+02 4.44147368e+01 2.10190932e+02 3.58740354e+01 -3.70987385e+00 2.07882596e+02
1716.lowfreq: -14.7450 -0.0007 0.0005 0.0009 2.3670 6.2245 21.2418 21.8926 26.8540
frequency: 21.2145 21.6179 26.5007 50.6471 54.0900 79.8176 92.5939 108.2903 123.8298 131.2869 150.0734 187.6074 217.1466 230.6202 244.2599 248.9823 276.3131 281.3716 286.7850 294.7440 297.4526 319.1270 331.3092 353.0093 370.9985 392.9466 401.6152 420.1857 434.3277 462.0875 467.9089 472.8601 499.6712 533.9547 542.9212 544.6496 575.8251 587.4368 632.9441 643.4628 660.0292 685.5118 707.7839 726.5096 766.9170 804.7277 828.2465 833.5965 842.9133 849.8448 856.6377 888.0682 907.8089 910.4176 922.7409 941.8219 943.4967 959.9330 971.4750 972.1086 988.2429 999.0151 1026.3751 1032.1567 1049.3802 1057.6900 1074.4373 1088.2212 1094.2181 1106.2869 1117.4116 1132.8377 1139.0632 1162.0563 1171.2199 1174.3244 1186.4751 1193.4983 1215.6600 1221.7873 1241.5348 1242.2479 1262.6680 1269.6995 1270.9834 1276.9788 1291.6036 1299.1397 1308.5700 1325.4841 1334.8422 1346.7680 1350.1336 1358.1846 1360.2954 1369.3745 1383.5325 1416.8284 1432.5085 1455.7264 1461.1360 1469.8867 1471.3443 1474.6372 1476.4025 1488.5523 1491.6131 1525.2445 1591.4189 1650.7042 2913.7360 2960.5619 2973.7696 2978.4293 2984.5081 2986.2266 2994.4174 3000.0983 3006.3726 3021.2797 3027.6717 3041.2111 3043.9297 3048.2535 3057.8207 3073.7020 3078.6321 3084.0097 3139.6125 3149.7474 3174.2595 3451.4164
redmass: 8.1842 6.7842 10.4028 5.6644 5.2248 5.8736 5.1070 7.7082 4.0249 4.1995 3.6851 3.6452 2.0242 1.2751 3.5297 3.7261 3.7255 2.6244 3.3727 2.7426 2.3555 2.1187 2.8406 4.9222 4.7659 3.1537 6.0316 3.6872 3.3909 3.0622 3.9489 5.2578 3.6211 3.8086 5.5043 3.8824 3.0460 3.4276 4.9561 3.0300 3.0094 3.3761 2.8525 4.9020 2.8083 1.8884 1.6492 1.9624 9.2754 2.4695 2.1099 2.5254 2.0019 2.4067 2.0959 2.3012 14.8809 2.1001 1.4685 1.9318 1.7776 1.7009 2.0437 2.1588 2.2700 2.5852 2.1029 1.1769 1.9516 1.9148 1.5172 1.6260 1.9143 1.3540 1.5574 1.3902 1.9099 1.5995 1.5243 1.8946 2.0117 1.9271 1.4749 1.7949 1.6035 1.4273 1.4693 1.5064 1.5485 1.4082 1.5141 1.4684 1.5055 1.4791 3.8206 1.4623 1.2207 4.1108 1.0783 1.0849 1.4134 1.1387 1.3881 1.1496 1.0647 1.0755 1.1251 5.6382 6.4808 11.6713 1.0799 1.0804 1.0641 1.0355 1.0602 1.0666 1.0644 1.0625 1.0760 1.0729 1.0938 1.0971 1.1011 1.1022 1.0975 1.1019 1.1002 1.1000 1.0919 1.0874 1.0969 1.0653
irintensity: 1.1062 2.3176 0.6428 2.9945 2.8728 6.2242 3.3814 24.8379 4.0087 1.4240 6.1944 20.2507 3.0124 2.9038 43.1411 23.2407 17.1937 1.1072 11.0447 5.8880 3.7065 42.5008 6.1540 40.6540 5.6640 5.9770 37.3027 0.7266 4.9623 11.9911 1.1216 26.1767 10.6536 0.6024 164.0386 63.4048 12.6921 1.2911 3.0047 6.7714 0.3920 6.1924 6.2163 0.6430 1.0564 6.8476 8.2931 3.4350 90.9061 17.6795 2.8682 3.4084 18.2410 24.7175 6.3769 5.8629 71.4398 4.5390 1.2983 4.0711 0.6702 25.3466 8.5444 8.9912 16.1665 2.9122 35.1127 195.4871 21.5333 6.4991 0.3857 11.6087 22.4376 6.7788 5.6381 9.6860 2.8895 3.5634 48.3263 27.5167 58.8844 4.1313 0.6674 26.9886 3.5350 1.9559 2.4628 2.7566 4.4217 1.9193 0.6246 3.2161 1.3542 0.7678 8.8503 4.2837 11.5445 6.3527 28.7089 8.4041 16.6446 11.5745 24.8035 8.9748 12.2010 22.9873 17.2419 52.2643 163.9037 161.1978 34.6945 16.0496 10.3166 14.7128 30.4361 41.4190 40.4085 11.1317 46.8375 38.3996 29.4880 24.0849 46.7672 47.5320 10.3977 27.2614 40.5702 17.1180 2.5757 7.7955 4.6832 105.8183
temp: 298.150 k
press: 1.00000 atm
elementType: 16 8 8 8 8 8 6 6 6 6 6 6 6 6 6 6 6 6 6 6 6 6 6 6 1 1 1 1 1 1 1 1 1 1 1 1 1 1 1 1 1 1 1 1 1 1
symmnumber: 1
zpe: 960069.8 jmol-1
zpe.correction: 0.365671 hartree
zpe.thermalcorrener: 0.388869 hartree
zpe.thermalcorrenthalpy: 0.389814 hartree
zpe.thermalcorrgfe: 0.311731 hartree
zpe.sumelectzpe: -1471.321434 hartree
zpe.sumelectthermal: -1471.298236 hartree
zpe.sumelectthermalent: -1471.297292 hartree
zpe.sumelectthermalfe: -1471.375375 hartree
dipole: 5.7650 5.3476 0.9472
dipole: 7.9202
quadrupole: -194.2097 -152.8607 -145.5458
quadrupole: 0.3750 -22.8402 0.2694
quadrupole: -30.0043 11.3447 18.6596 0.3750 -22.8402 0.2694
hfenergy: -1471.6871058 hartree
pointgroup: C01 [X(C18H22O5S1)]
dipole: -2.1234635 -2.2147358 0.5436121 debye
polarizability: 420.9792707|55.3539938|216.393641|-45.054954|-0.4833191|210.2237333 unknown
InChI: InChI=1S/C18H21O2.HO3S/c1-18-9-8-14-13-5-3-12(19)10-11(13)2-4-15(14)16(18)6-7-17(18)20;1-4(2)3/h3,5,10,14-16H,2,4,6-9H2,1H3;1H
charge 0 multiplicity 1
46 atoms
S  5.112149 1.17386 -0.862651
O  -4.982036 1.707573 0.694538
O  4.334672 -0.518958 0.203138
O  6.732279 0.758074 -0.104215
O  5.326614 1.128699 -2.461087
O  4.49989 2.51528 -0.193947
C  -2.39388 -0.294928 -0.875129
C  -2.776274 1.110251 -0.299239
C  -2.13956 -1.381107 0.218159
C  -1.270484 -0.870843 1.405194
C  -2.027593 1.534817 0.984118
C  -3.63535 -0.678062 -1.751407
C  -1.923519 0.395635 2.01652
C  -1.494322 -2.663795 -0.36194
C  -4.304835 0.991702 -0.081827
C  -4.86013 -0.130009 -0.973831
C  -2.581886 2.216875 -1.385514
C  0.209323 -0.73086 1.031959
C  -0.08866 -2.388795 -0.938115
C  0.768889 -1.484811 -0.056763
C  1.072357 0.10312 1.805841
C  2.141687 -1.369511 -0.338969
C  2.440329 0.212502 1.532675
C  2.998979 -0.54554 0.452681
H  -1.487878 -0.193654 -1.501685
H  -3.122737 -1.658637 0.654142
H  -1.308007 -1.668315 2.183405
H  -2.566238 2.393722 1.427489
H  -1.01337 1.887335 0.711966
H  -3.703577 -1.766219 -1.922048
H  -3.565525 -0.201491 -2.745356
H  -1.380482 0.742903 2.914302
H  -2.937871 0.11931 2.366056
H  -2.131218 -3.111788 -1.147129
H  -1.419742 -3.413897 0.450362
H  -5.318262 -0.89442 -0.316645
H  -5.674399 0.252851 -1.614517
H  -1.511814 2.28618 -1.654767
H  -3.154706 2.015719 -2.308364
H  -2.906322 3.196417 -0.991338
H  -0.176639 -1.91933 -1.938723
H  0.441959 -3.345032 -1.106648
H  0.653799 0.678272 2.636933
H  2.591591 -1.927386 -1.168889
H  3.095695 0.862964 2.120002
H  6.499004 0.076027 0.594262
