program: Gaussian 09
title: 000035658
version: EM64L-G09RevD.01
frameworkgroup: C1[X(C5H6ClN3)]
method: RPBEPBE
basis: SDD
operation: Freq
keyword: #p
keyword: freq=noraman
keyword: PBEPBE/SDD
title: #p freq=noraman PBEPBE/SDD
converged: YES YES NO NO
title: Mulliken charges:
elementType: Cl N N N C C C C C H H H H H H
charge: 0.016967 -0.044724 0.054100 0.053685 0.087809 0.087839 -0.734190 -0.734183 -0.291972 0.252165 0.250530 0.249643 0.251985 0.249662 0.250685
chargesum: 0.00000
title: Mulliken charges with hydrogens summed into heavy atoms:
elementType: Cl N N N C C C C C
charge: 0.016967 -0.044724 0.054100 0.053685 0.087809 0.087839 0.018148 0.018149 -0.291972
polarizability: 1.10496607e+02 -2.99509758e-02 9.41020121e+01 6.44546997e-01 -9.28294087e-03 4.38014981e+01
1716.lowfreq: -28.5294 -4.0110 -3.2007 0.0003 0.0019 0.0024 7.4692 19.3148 140.3653
frequency: -28.5271 18.3974 140.3646 172.2681 176.2795 229.6881 275.9537 394.6117 469.0266 537.8545 576.5320 578.6664 616.0518 791.7776 834.0989 904.8989 924.1226 985.9725 1028.3839 1045.1273 1056.0414 1171.3472 1223.6959 1323.1017 1363.8134 1395.4179 1399.7225 1426.0900 1439.6020 1454.2167 1457.0533 1470.2558 1485.8016 2996.4304 2996.7255 3088.2202 3088.4996 3139.3711 3139.6908
redmass: 1.0168 1.0195 12.2329 5.7279 3.5993 5.5599 2.5639 14.0332 3.3657 6.2308 3.2650 4.8264 5.5290 5.2932 6.2712 11.5557 4.6751 1.7255 2.1448 1.7040 1.6700 4.6636 6.4949 5.7223 2.3599 1.2944 1.7012 2.3632 1.3269 1.0832 1.2652 1.3658 3.2765 1.0420 1.0418 1.0900 1.0898 1.1023 1.1023
irintensity: 0.3127 0.9531 0.1780 0.0162 3.4688 0.1328 6.3512 9.1864 1.8294 12.2726 1.0021 12.1075 1.5844 1.8975 72.4108 0.2072 3.5516 22.3662 1.5950 18.6990 4.9855 0.0102 175.7327 2.6397 59.5551 63.4774 61.2543 328.1791 139.2156 36.7445 60.3396 45.3077 270.8493 0.8782 0.9990 5.1187 12.1828 1.0690 9.1330
temp: 298.150 k
press: 1.00000 atm
elementType: 17 7 7 7 6 6 6 6 6 1 1 1 1 1 1
symmnumber: 1
zpe: 280016.9 jmol-1
zpe.correction: 0.106653 hartree
zpe.thermalcorrener: 0.114965 hartree
zpe.thermalcorrenthalpy: 0.115909 hartree
zpe.thermalcorrgfe: 0.071573 hartree
zpe.sumelectzpe: -817.777857 hartree
zpe.sumelectthermal: -817.769545 hartree
zpe.sumelectthermalent: -817.768601 hartree
zpe.sumelectthermalfe: -817.812936 hartree
dipole: 2.7996 0.0031 0.1670
dipole: 2.8045
quadrupole: -62.8544 -54.9928 -58.1633
quadrupole: -0.0091 0.3167 -0.0039
quadrupole: -4.1842 3.6774 0.5069 -0.0091 0.3167 -0.0039
hfenergy: -817.8845096 hartree
pointgroup: C01 [X(C5H6Cl1N3)]
dipole: -1.1017661 0.0000094 -0.0598012 debye
dipolederiv: -1.0110026 -0.0006179 0.0056342 -0.0008854 -0.0947807 0.0000118 0.0082154 0.0000165 -0.0768477 -0.5636931 0.0007305 0.0149654 0.0000138 -1.1941515 -0.0000189 0.0022563 -0.0000684 -0.1528773 -1.18327 0.2876753 -0.0064921 0.507493 -0.7282657 -0.0054707 0.0075115 0.0014199 -0.1300267 -1.1815763 -0.2873083 -0.0066406 -0.5080071 -0.7291832 0.0055223 0.0077471 -0.0011908 -0.1298464 0.8916841 0.2535767 0.0128281 0.2546493 1.1104755 0.024964 0.0321379 0.074388 0.1007607 0.8911224 -0.25287 0.0125773 -0.2545184 1.1107131 -0.0245659 0.0315327 -0.0736132 0.100306 -0.0727753 -0.1718898 -0.0167137 -0.1969025 -0.3471434 -0.0289291 -0.0900399 -0.1580913 -0.0240296 -0.0665763 0.1630991 -0.0164622 0.1987988 -0.3531034 0.0284031 -0.0886102 0.1554137 -0.0239843 2.0650831 0.0009592 -0.0067077 0.0015304 0.8132983 -0.0000371 -0.0321899 -0.0001763 0.0937029 0.0379392 0.0610358 -0.0688679 0.0311722 0.0346311 0.0619473 -0.0230106 0.1061148 0.080784 -0.0340748 0.0006505 0.0759284 0.0454957 0.0834264 -0.0241805 0.0899819 0.0310155 0.0963014 0.1137518 -0.0344243 -0.0035346 -0.0282219 0.0859817 -0.0334049 -0.0058497 -0.0325682 -0.0556886 0.0389776 -0.0564989 -0.0702729 -0.0301964 0.0371298 -0.0636132 -0.0239499 -0.1078144 0.0771345 0.1124875 0.0354308 0.0009887 0.0272026 0.0865508 0.0359396 -0.002357 0.0352847 -0.0548777 -0.0380771 0.0004512 0.0727696 -0.0476239 0.0844213 0.0234321 0.0866242 -0.0301304 0.0991888 unknown
polarizability: 110.5015173|0.0479265|94.1020982|0.2868222|0.0061367|43.7965021 unknown
InChI: InChI=1S/C5H6ClN3/c1-3-7-4(2)9-5(6)8-3/h1-2H3
charge 0 multiplicity 1
15 atoms
Cl 3.091422 0.002863 -0.015798
N  -1.416714 -0.001397 0.028435
N  0.682039 1.211578 0.010376
N  0.684364 -1.210475 0.010757
C  -0.693222 -1.166344 0.021111
C  -0.695634 1.164799 0.020762
C  -1.432137 -2.472333 0.006235
C  -1.436353 2.469771 0.005917
C  1.279998 0.001238 0.002445
H  -0.861157 -3.243133 0.546968
H  -2.436514 -2.349413 0.438462
H  -1.551233 -2.82106 -1.037706
H  -0.877648 3.235159 0.567096
H  -1.533431 2.831317 -1.035898
H  -2.448779 2.340429 0.416636
