program: Gaussian 09
title: 000035657
version: EM64L-G09RevD.01
frameworkgroup: C1[X(C7H10ClN3S2)]
method: RPBEPBE
basis: SDD
operation: Freq
keyword: #p
keyword: freq=noraman
keyword: PBEPBE/SDD
title: #p freq=noraman PBEPBE/SDD
converged: YES YES NO NO
title: Mulliken charges:
elementType: Cl S S N N N C C C C C C C H H H H H H H H H H
charge: 0.022984 0.305709 0.305712 0.063707 0.096154 0.096157 -0.577429 -0.577429 -0.299479 -0.299479 -0.660609 -0.660609 -0.302284 0.273755 0.273785 0.273786 0.273755 0.234008 0.234002 0.227896 0.234002 0.234008 0.227896
chargesum: 0.00000
title: Mulliken charges with hydrogens summed into heavy atoms:
elementType: Cl S S N N N C C C C C C C
charge: 0.022984 0.305709 0.305712 0.063707 0.096154 0.096157 -0.029889 -0.029889 -0.299479 -0.299479 0.035298 0.035298 -0.302284
polarizability: 2.06819845e+02 8.55606098e-07 1.81755860e+02 -1.39305681e-02 1.64787532e-03 7.05451121e+01
1716.lowfreq: -5.0749 -0.0037 -0.0035 -0.0031 6.5642 8.6005 38.5964 47.2234 64.5359
frequency: 38.5118 47.1570 64.5200 69.8094 71.2374 119.1855 135.8217 160.3613 163.2169 187.2985 236.5222 236.8384 237.8506 268.5175 293.1926 416.1686 430.6502 439.6520 494.8251 613.1832 616.7353 621.4387 628.4162 779.2183 780.9050 785.2917 787.4053 787.8282 884.9273 993.6191 995.3951 1043.9804 1045.7757 1068.5824 1069.1620 1159.7339 1183.7898 1216.0122 1233.9051 1237.3837 1238.8269 1274.5062 1285.3372 1391.4982 1403.2678 1403.7440 1427.4082 1443.0879 1450.3703 1473.0851 1473.3272 1482.2221 1482.3137 2991.7941 2991.9573 3045.3945 3046.3985 3086.9224 3087.1690 3089.4096 3089.4159 3127.5712 3127.5755
redmass: 4.5692 3.5206 1.7715 3.5832 2.2412 4.7226 14.1379 10.9168 10.8130 9.3640 1.1270 1.1323 5.7744 4.9599 3.8173 13.4255 12.9747 11.3189 11.9120 12.0902 12.3404 4.7028 4.9440 1.1195 1.2799 5.1745 13.6232 13.1984 13.9727 1.7958 1.7932 1.2142 1.2153 2.2729 2.2695 10.8859 11.4961 10.4844 1.2281 1.2270 5.5079 1.3157 1.4393 10.2659 1.2034 1.2273 10.8629 1.0913 1.0887 1.0382 1.0381 1.0480 1.0477 1.0358 1.0358 1.0586 1.0587 1.0980 1.0979 1.1017 1.1016 1.1080 1.1081
irintensity: 0.0000 0.1285 0.0000 0.0083 2.6575 1.1623 0.0113 0.0000 0.0125 0.0274 0.0000 0.0881 2.5561 8.4724 0.1292 0.2818 7.7041 1.0742 0.0768 0.0000 0.1895 0.8305 7.1351 0.0002 23.2878 0.2519 192.6099 96.0041 5.0792 1.7925 36.9759 0.0001 0.4420 8.8152 0.7755 82.8372 251.0881 180.9387 0.0000 0.5864 31.3724 5.6179 18.8355 759.9574 34.5516 0.0406 891.8389 2.4275 0.8355 0.0002 32.5290 4.1446 11.1942 30.6058 28.0565 13.4982 1.4906 16.0851 24.2468 20.7255 0.0025 0.5377 47.3825
temp: 298.150 k
press: 1.00000 atm
elementType: 17 16 16 7 7 7 6 6 6 6 6 6 6 1 1 1 1 1 1 1 1 1 1
symmnumber: 1
zpe: 433985.0 jmol-1
zpe.correction: 0.165296 hartree
zpe.thermalcorrener: 0.180340 hartree
zpe.thermalcorrenthalpy: 0.181284 hartree
zpe.thermalcorrgfe: 0.120776 hartree
zpe.sumelectzpe: -1692.178399 hartree
zpe.sumelectthermal: -1692.163355 hartree
zpe.sumelectthermalent: -1692.162411 hartree
zpe.sumelectthermalfe: -1692.222918 hartree
dipole: -6.7008 0.0000 0.0023
dipole: 6.7008
quadrupole: -94.8734 -100.2346 -98.4864
quadrupole: -0.0001 -0.0087 -0.0012
quadrupole: 2.9914 -2.3698 -0.6216 -0.0001 -0.0087 -0.0012
hfenergy: -1692.3436949 hartree
pointgroup: C01 [X(C7H10Cl1N3S2)]
dipole: -2.6362869 0.0000354 0.0015971 debye
dipolederiv: -1.107631 0.0000122 0.000373 0.0000118 -0.1070272 -0.0000065 0.0013874 -0.0000124 -0.0656059 -0.3245369 -0.4055837 -0.0000289 -0.4823575 -0.5372898 0.0000429 -0.0002542 -0.0001945 -0.0564366 -0.3245144 0.4055796 0.0001064 0.4823526 -0.537313 -0.0001776 -0.0000832 0.0000338 -0.0564353 -0.5663421 -0.0000191 -0.0000643 -0.0000149 -1.9915244 -0.0003423 0.0000634 -0.000407 -0.0664912 -1.5671978 0.6434323 0.0002363 0.5553188 -1.0590795 -0.0005392 -0.0000736 0.0002433 -0.1157416 -1.5672381 -0.6434254 0.0000316 -0.5553069 -1.0590534 0.000193 -0.000306 -0.0006084 -0.1157407 0.5185061 0.1772993 -0.00038 0.0355471 0.0028706 -0.000005 -0.0001863 0.0000599 0.1223959 0.5185022 -0.1773131 -0.0003801 -0.0355611 0.0028769 -0.0000452 -0.0001535 -0.0001172 0.1223955 1.1911389 0.5146984 0.0003438 0.6459227 1.8030663 0.000053 0.0002629 0.0004406 0.0384039 1.1910992 -0.5146798 0.0001785 -0.6459097 1.8030951 0.0005468 -0.0000016 0.0002277 0.0384031 -0.1250305 -0.1639933 0.0000546 0.029799 0.0501185 -0.0001134 0.0002343 0.0001325 0.0674478 -0.125027 0.1639971 0.000091 -0.0297944 0.0501161 0.0000993 0.0001889 -0.0001106 0.0674481 2.364562 -0.0000088 -0.0007334 -0.0000107 1.4112062 0.0002611 -0.0011069 0.0002767 0.0807201 -0.0539567 -0.0240521 0.0158442 0.0397942 0.007567 -0.0948059 0.0010156 -0.0956711 -0.0219364 -0.0537755 -0.0236115 -0.0158025 0.0400405 0.0073433 0.0947153 -0.0009231 0.0957148 -0.021506 -0.0537794 0.0236438 -0.0157989 -0.0400209 0.0074175 -0.0947115 -0.0009441 -0.0956991 -0.0215841 -0.0539531 0.0240239 0.015852 -0.0398106 0.0074935 0.0948093 0.0009991 0.095687 -0.0218579 0.1182947 0.0628086 0.0569878 -0.0219395 0.0110362 -0.0907167 0.0144748 -0.1161438 -0.0557738 0.118155 0.0631274 -0.0572066 -0.0217844 0.0106002 0.0908967 -0.014825 0.1161777 -0.0552447 -0.1668615 -0.0160415 0.0002751 0.0271993 0.0474212 -0.0000842 0.0002822 -0.0000606 0.1240792 0.1181657 -0.0630866 -0.0572058 0.0218015 0.0106851 -0.090865 -0.0147907 -0.1161611 -0.0553415 0.1182825 -0.0628538 0.0569927 0.0219182 0.0109525 0.0907461 0.0145143 0.1161603 -0.055677 -0.1668623 0.0160463 0.0002335 -0.0271949 0.0474211 0.0000492 0.0002252 0.0000316 0.1240792 unknown
polarizability: 206.8198284|-0.0002294|181.7558563|-0.0495323|0.0194649|70.5451321 unknown
InChI: InChI=1S/C7H10ClN3S2/c1-3-12-6-9-5(8)10-7(11-6)13-4-2/h3-4H2,1-2H3
charge 0 multiplicity 1
23 atoms
Cl 4.253563 -0.000052 -0.000932
S  -0.348357 -2.749534 -0.001008
S  -0.34829 2.749537 0.000052
N  -0.258305 0.000001 -0.000443
N  1.849696 1.210841 0.000313
N  1.849665 -1.210888 -0.000198
C  -2.177384 -2.220411 0.001204
C  -2.17733 2.22046 0.001741
C  0.476605 -1.1527 -0.000771
C  0.47663 1.152684 -0.000256
C  -3.042336 -3.487455 0.000704
C  -3.042251 3.487523 0.001618
C  2.445908 -0.000031 0.001018
H  -2.335519 -1.601018 0.897462
H  -2.337128 -1.59923 -0.893536
H  -2.336939 1.599647 -0.893277
H  -2.335628 1.600705 0.897721
H  -2.858851 -4.105991 -0.895266
H  -2.857247 -4.107777 0.895107
H  -4.109937 -3.202054 0.001943
H  -2.857298 4.107478 0.896305
H  -2.858605 4.106419 -0.894069
H  -4.10986 3.202145 0.002568
