program: Gaussian 09
title: 000035686
version: EM64L-G09RevD.01
frameworkgroup: C1[X(C17H14N4O3)]
method: RPBEPBE
basis: SDD
operation: Freq
keyword: #p
keyword: freq=noraman
keyword: PBEPBE/SDD
title: #p freq=noraman PBEPBE/SDD
converged: YES YES NO NO
title: Mulliken charges:
elementType: O O O N N N N C C C C C C C C C C C C C C C C C H H H H H H H H H H H H H H
charge: -0.201022 -0.437773 -0.243143 -0.276026 -0.029943 -0.054418 -0.068612 -0.438334 0.236118 0.174060 0.426782 -0.763646 -0.349451 -0.387383 -0.220780 -0.202145 0.155380 -0.247934 -0.331189 -0.269895 0.260374 -0.332686 -0.302986 0.118169 0.290432 0.239326 0.253050 0.253608 0.297265 0.279467 0.228295 0.227467 0.229672 0.261882 0.280324 0.278062 0.279095 0.388537
chargesum: 0.00000
title: Mulliken charges with hydrogens summed into heavy atoms:
elementType: O O O N N N N C C C C C C C C C C C C C C C C C
charge: -0.201022 -0.049236 -0.243143 -0.276026 -0.029943 -0.054418 -0.068612 -0.147902 0.236118 0.174060 0.426782 -0.017662 -0.052186 -0.107917 0.007516 0.025321 0.155380 -0.018263 -0.069307 0.010429 0.260374 -0.054624 -0.023891 0.118169
polarizability: 4.55313993e+02 1.12207287e+01 1.82803259e+02 2.34637918e+01 -8.18558878e-01 1.62741585e+02
1716.lowfreq: -3.6655 -1.2433 -0.0010 -0.0006 0.0002 5.7787 17.1167 17.8707 25.8705
frequency: 17.0221 17.7586 25.8249 47.6416 57.5771 72.5769 74.8297 99.9145 144.3502 153.1280 154.9965 166.2164 201.6187 223.4712 244.0135 274.6788 290.2497 328.3386 343.9709 354.0829 377.1673 408.9283 409.1861 419.5534 447.7514 493.0903 510.9629 512.4663 549.7964 573.7474 596.8710 598.1116 614.3801 624.2237 643.5840 657.0774 687.3874 699.9786 705.3026 732.3324 768.9278 770.2305 790.9792 824.7883 855.3544 864.1198 885.7754 913.3530 932.6500 937.3965 982.4871 985.8691 987.8712 999.3067 999.4947 1001.1722 1008.9770 1010.2946 1021.6235 1030.2375 1041.6392 1046.6315 1097.2042 1110.7206 1123.9089 1145.8405 1155.0909 1172.8634 1184.7744 1190.9580 1198.7223 1250.1003 1289.4025 1298.2154 1322.8856 1324.6140 1355.3248 1378.3554 1383.9483 1394.3971 1400.7683 1418.7106 1447.8446 1453.8244 1454.6423 1481.4572 1485.7070 1574.4035 1581.6564 1596.4965 1611.4609 1612.7935 1640.7720 1644.1587 2975.2908 2981.9256 3057.5940 3114.0389 3130.9441 3142.7385 3156.7390 3162.4129 3163.9725 3175.5288 3184.2222 3188.1497 3190.6449 3532.3451
redmass: 6.3583 5.5564 5.0263 4.8558 8.1960 6.1493 7.3817 4.2924 4.1846 1.1290 6.5734 6.7906 6.5401 4.3050 5.1519 6.3021 7.7632 5.5925 5.8316 6.4918 5.6858 2.9322 2.9582 5.9630 8.0369 5.5865 3.1396 3.4355 5.9701 4.3386 3.3478 1.5100 6.4499 6.8008 5.6301 5.9051 3.5169 2.0884 8.4193 5.6580 3.9350 1.7338 6.7300 5.9661 1.2435 1.2426 1.7501 3.5561 1.4176 3.9056 2.2353 5.7400 1.3596 1.3285 2.9500 1.4798 1.5269 3.2325 2.8440 2.1199 3.2636 2.4211 1.6654 1.3028 3.8548 1.7046 1.8299 1.0526 1.3729 1.1581 1.7411 1.6311 2.4518 1.5883 2.7598 1.3552 3.3233 6.8124 9.0324 10.1906 1.4424 4.0560 2.3238 1.1062 1.0643 2.5344 2.4558 7.7391 6.1758 6.7936 6.0216 6.3266 8.8958 12.0276 1.0791 1.0397 1.0968 1.0987 1.0854 1.0909 1.0886 1.0975 1.0885 1.0972 1.0971 1.0939 1.0962 1.0642
irintensity: 0.2249 0.3483 0.5693 1.0192 0.9448 0.6756 3.4617 0.1691 2.2129 0.4188 0.3728 0.6030 0.8463 0.8598 1.5639 4.0190 2.2216 2.9517 10.4727 1.5536 1.8158 1.0233 0.3118 8.3440 39.6013 13.3593 32.0684 11.6319 12.5655 6.2414 39.6159 53.2628 0.2266 7.2142 26.8095 7.7618 70.3211 40.7167 49.6587 8.3380 13.7548 73.1723 12.8155 0.8029 0.2618 0.3663 62.2870 21.9620 10.6011 16.2062 39.1667 4.8468 0.0015 10.8565 103.3314 14.3514 14.2216 17.7922 178.1163 12.4703 23.8895 38.3547 33.3831 2.1056 81.1364 46.9626 122.5293 0.0319 13.9577 4.7682 7.6575 7.6558 188.5506 51.9665 131.6416 2.7576 35.5882 12.5023 2.0822 24.2944 29.0669 21.9041 7.6555 19.9302 19.3445 3.2596 169.1577 24.0141 7.1467 14.5717 68.3850 7.8745 324.2169 225.4079 17.6406 11.7677 9.4728 9.7774 0.4142 22.0076 0.3299 37.4519 0.0444 3.3392 0.7023 1.1933 7.8776 61.5494
temp: 298.150 k
press: 1.00000 atm
elementType: 8 8 8 7 7 7 7 6 6 6 6 6 6 6 6 6 6 6 6 6 6 6 6 6 1 1 1 1 1 1 1 1 1 1 1 1 1 1
symmnumber: 1
zpe: 736612.0 jmol-1
zpe.correction: 0.280561 hartree
zpe.thermalcorrener: 0.301440 hartree
zpe.thermalcorrenthalpy: 0.302384 hartree
zpe.thermalcorrgfe: 0.227419 hartree
zpe.sumelectzpe: -1099.157356 hartree
zpe.sumelectthermal: -1099.136476 hartree
zpe.sumelectthermalent: -1099.135532 hartree
zpe.sumelectthermalfe: -1099.210497 hartree
dipole: -0.2798 2.1764 -2.2368
dipole: 3.1334
quadrupole: -136.5999 -126.9266 -137.0292
quadrupole: -3.3700 -6.1868 4.0664
quadrupole: -3.0813 6.5919 -3.5106 -3.3700 -6.1868 4.0664
hfenergy: -1099.4379166 hartree
pointgroup: C01 [X(C17H14N4O3)]
dipole: 0.0959377 -0.6299802 -1.0552885 debye
polarizability: 454.9027099|15.569614|181.2664717|-23.5892489|5.1240932|164.6896545 unknown
InChI: InChI=1S/C17H14N4O3/c1-11-15(16(22)21(20-11)14-5-3-2-4-6-14)19-18-13-9-7-12(8-10-13)17(23)24/h2-10,15,23H,1H3
charge 0 multiplicity 1
38 atoms
O  1.742543 0.522507 1.843911
O  -6.712754 1.927227 -1.140884
O  -7.631792 0.59341 0.523982
N  2.999487 -0.39171 0.02008
N  2.822396 -1.421925 -0.967025
N  -0.392985 -0.775886 0.005572
N  -1.357011 -1.128902 0.80459
C  0.898869 -1.377831 0.415119
C  1.643484 -1.977121 -0.769662
C  1.895919 -0.274508 0.887625
C  4.221253 0.353088 0.010897
C  1.114406 -3.067132 -1.64577
C  4.435026 1.398091 0.948451
C  5.218218 0.034175 -0.947449
C  5.650348 2.11437 0.915145
C  6.424681 0.763159 -0.963042
C  -2.637279 -0.54703 0.488133
C  6.650556 1.805981 -0.034537
C  -3.715668 -1.015168 1.282104
C  -2.855932 0.436929 -0.516601
C  -5.235781 0.459615 0.063003
C  -5.01307 -0.516656 1.068217
C  -4.151321 0.935479 -0.725584
C  -6.623902 0.96241 -0.125687
H  0.751398 -2.10777 1.238623
H  0.890817 -3.977849 -1.058752
H  1.844751 -3.318962 -2.430835
H  0.168165 -2.749656 -2.122952
H  3.665312 1.639013 1.684328
H  5.034975 -0.771485 -1.661361
H  5.811441 2.919986 1.639939
H  7.190815 0.513487 -1.705397
H  7.590199 2.368352 -0.051808
H  -3.508709 -1.762606 2.054207
H  -2.005408 0.792307 -1.105472
H  -5.862457 -0.862643 1.665195
H  -4.343864 1.694085 -1.488893
H  -7.658526 2.224769 -1.219509
