program: Gaussian 09
title: 000035648
version: EM64L-G09RevD.01
frameworkgroup: C1[X(C6H7Cl2N3)]
method: RPBEPBE
basis: SDD
operation: Freq
keyword: #p
keyword: freq=noraman
keyword: PBEPBE/SDD
title: #p freq=noraman PBEPBE/SDD
converged: NO NO NO NO
title: Mulliken charges:
elementType: Cl Cl N N N C C C C C C H H H H H H H
charge: 0.048407 0.045965 0.042348 0.055267 0.148381 -0.154103 0.121207 -0.692797 -0.692803 -0.282432 -0.276297 0.250961 0.241056 0.226064 0.225825 0.225828 0.226069 0.241053
chargesum: 0.00000
title: Mulliken charges with hydrogens summed into heavy atoms:
elementType: Cl Cl N N N C C C C C C
charge: 0.048407 0.045965 0.042348 0.055267 0.148381 0.096858 0.121207 0.000148 0.000147 -0.282432 -0.276297
polarizability: 1.29967114e+02 -4.81017803e+00 1.25835507e+02 1.75032415e-03 4.58245484e-03 6.06935155e+01
1716.lowfreq: -5.0455 -0.0034 -0.0022 -0.0020 4.2575 9.7179 30.2122 98.9158 143.7350
frequency: 29.7618 98.8951 143.7338 144.9185 152.6263 192.0718 217.1443 247.6700 279.0850 294.6681 378.2420 384.9702 433.8765 495.7390 604.6405 634.3381 685.1366 785.0229 810.7198 821.9949 888.9528 909.4634 930.4430 963.5596 1061.2617 1098.6632 1156.2953 1166.8276 1199.5585 1205.8841 1302.7873 1306.0929 1351.6547 1374.6256 1397.3185 1422.7918 1448.5661 1464.9404 1471.3008 1477.7984 1495.5333 2986.5303 2987.6876 3040.8939 3083.0444 3086.8351 3095.9730 3102.8016
redmass: 3.0096 4.1309 3.9927 13.0878 13.7008 12.8864 1.0383 1.1156 3.1642 4.4339 3.8708 12.4527 14.7308 4.9276 3.3958 12.3694 8.5533 11.7852 4.4500 9.7474 10.2155 2.8575 1.1633 1.4720 1.8636 2.7366 2.8773 3.2392 6.1796 10.9807 1.9914 1.3014 3.2152 1.1802 1.4252 5.1167 6.2829 1.0445 1.0486 1.0474 1.1186 1.0344 1.0349 1.0856 1.1008 1.0999 1.1013 1.0999
irintensity: 0.0347 0.0546 0.7941 0.0329 0.0016 0.3152 0.0019 0.5239 1.8594 0.2236 1.1655 3.0393 9.1826 4.3952 4.2747 0.0050 0.8708 135.8426 62.9383 2.8710 4.9753 41.3879 5.3814 0.2958 32.3250 0.1297 15.7142 11.8439 161.6137 96.3505 130.9181 0.0060 58.5383 14.8859 27.3602 437.6930 467.9560 7.6465 1.3178 10.0539 76.4291 29.1381 19.0149 3.1901 17.9326 37.8908 2.8360 39.8493
temp: 298.150 k
press: 1.00000 atm
elementType: 17 17 7 7 7 6 6 6 6 6 6 1 1 1 1 1 1 1
symmnumber: 1
zpe: 330847.2 jmol-1
zpe.correction: 0.126013 hartree
zpe.thermalcorrener: 0.137093 hartree
zpe.thermalcorrenthalpy: 0.138037 hartree
zpe.thermalcorrgfe: 0.087613 hartree
zpe.sumelectzpe: -1316.375446 hartree
zpe.sumelectthermal: -1316.364366 hartree
zpe.sumelectthermalent: -1316.363422 hartree
zpe.sumelectthermalfe: -1316.413845 hartree
dipole: -2.9184 -0.8126 0.0000
dipole: 3.0294
quadrupole: -77.1532 -83.8068 -76.3230
quadrupole: 2.3705 -0.0004 0.0015
quadrupole: 1.9411 -4.7125 2.7714 2.3705 -0.0004 0.0015
hfenergy: -1316.5014588 hartree
pointgroup: C01 [X(C6H7Cl2N3)]
dipole: -1.1814325 0.1573072 0.0001443 debye
dipolederiv: -0.5059071 -0.4479401 -0.0000626 -0.4498064 -0.5565472 -0.000087 -0.0000907 -0.0000443 -0.050888 -0.1777553 0.2553801 0.000137 0.281487 -0.8645915 -0.0004418 0.000387 -0.0010274 -0.0516892 -1.1131535 0.541653 0.0003829 0.4148901 -0.925584 -0.0001772 -0.0000951 -0.0002661 -0.1136121 -1.4063145 -0.3883505 -0.0000222 -0.1688801 -0.616413 -0.0001044 0.0000395 -0.0002269 -0.1011004 -0.5840285 -0.2248695 -0.0002391 -0.2432704 -1.540323 -0.0004506 0.000217 -0.0001586 -0.0904824 -0.2496934 -0.0149492 -0.0000705 -0.1951801 0.0995327 0.0000036 -0.0000822 0.0000618 -0.0169662 1.4130342 -0.0297504 0.0000518 -0.0887514 0.7946822 0.0000949 -0.0000133 0.0002652 0.0491441 -0.0210526 -0.004871 0.0373884 0.1015734 0.0363761 0.0090752 -0.1145747 0.0491201 0.018074 -0.0209963 -0.0048509 -0.0373599 0.1015313 0.036408 -0.0090564 0.1146611 -0.049114 0.018052 1.4818956 0.6160756 0.0000563 0.6018217 1.5716502 0.0002115 -0.0000055 0.0002457 0.1102206 1.102569 -0.3400014 -0.0002567 -0.3699018 1.9806709 0.0009679 -0.0004617 0.0011761 0.0865692 0.0587268 -0.0232211 0.0000031 0.0142882 -0.1014303 -0.0000261 0.0000273 -0.0000301 0.0388244 0.1209117 0.0384437 0.0064828 0.0067077 -0.1000792 0.0318348 -0.0031427 -0.0239542 0.0796559 -0.1813679 0.0507051 0.0270045 0.0345008 0.0904233 0.0192167 0.0243802 0.0126457 0.0771958 0.0718074 -0.0562894 -0.0932433 -0.0410958 0.0524582 -0.0793657 -0.0472562 -0.0533655 -0.1049518 0.0717891 -0.0563285 0.0932429 -0.0411202 0.0524157 0.0794126 0.0472733 0.0534129 -0.1048781 -0.1813593 0.0507335 -0.0270124 0.0345233 0.0904314 -0.0192062 -0.0244016 -0.0126366 0.0771824 0.1208948 0.0384309 -0.0064829 0.0066826 -0.1000806 -0.0319018 0.0031383 0.0238961 0.0796498 unknown
polarizability: 128.5657601|5.192676|127.2368508|-0.0051557|0.0251073|60.6935253 unknown
InChI: InChI=1S/C6H7Cl2N3/c1-3(2)4-9-5(7)11-6(8)10-4/h3H,1-2H3
charge 0 multiplicity 1
18 atoms
Cl 2.726663 2.279818 0.000272
Cl 1.56629 -2.960974 -0.001429
N  -0.315322 -1.033941 -0.000024
N  0.206127 1.330843 0.000327
N  1.992469 -0.30609 0.000033
C  -2.173256 0.60867 0.000109
C  -0.695862 0.290664 0.000106
C  -2.841968 0.038646 1.280705
C  -2.841843 0.039175 -1.280788
C  1.507123 0.958871 0.000124
C  1.015657 -1.24849 0.000398
H  -2.255616 1.709908 0.000332
H  -2.722086 -1.057852 1.31983
H  -3.920589 0.276736 1.271597
H  -2.402285 0.473973 2.195957
H  -2.402006 0.474806 -2.195817
H  -3.920444 0.277355 -1.271735
H  -2.722051 -1.057318 -1.320297
