program: Gaussian 09
title: 000035665
version: EM64L-G09RevD.01
frameworkgroup: C1[X(C7H4Cl7N3)]
method: RPBEPBE
basis: SDD
operation: Freq
keyword: #p
keyword: freq=noraman
keyword: PBEPBE/SDD
title: #p freq=noraman PBEPBE/SDD
converged: YES YES NO NO
title: Mulliken charges:
elementType: Cl Cl Cl Cl Cl Cl Cl N N N C C C C C C C H H H H
charge: 0.063935 0.114789 0.063925 0.114803 -0.010183 -0.010187 0.071878 0.007898 0.140783 0.140787 -0.536140 -0.536124 0.279239 0.279187 -0.549043 -0.549025 -0.326526 0.307612 0.312390 0.307613 0.312389
chargesum: 0.00000
title: Mulliken charges with hydrogens summed into heavy atoms:
elementType: Cl Cl Cl Cl Cl Cl Cl N N N C C C C C C C
charge: 0.063935 0.114789 0.063925 0.114803 -0.010183 -0.010187 0.071878 0.007898 0.140783 0.140787 -0.536140 -0.536124 0.279239 0.279187 0.070959 0.070977 -0.326526
polarizability: 1.72160476e+02 -9.87298180e-04 1.69383057e+02 7.80409633e+00 2.41469220e-02 1.54193313e+02
1716.lowfreq: -5.1436 -3.4252 -0.0038 -0.0031 -0.0029 5.3414 13.3043 16.5210 50.8873
frequency: 13.2692 16.4631 50.8839 56.7175 86.2097 96.0934 128.0517 129.6449 131.4256 139.7110 159.1731 166.2447 220.6677 222.3563 242.3352 250.8078 287.5095 302.4499 303.7243 335.7814 338.9503 414.9277 437.8473 527.5862 552.0427 600.2642 611.7271 653.3334 677.5065 680.2745 703.0866 725.5598 773.0477 831.0333 843.0881 867.0844 907.3215 959.8795 999.9597 1109.9149 1110.0994 1171.4850 1187.6752 1205.7314 1222.8149 1274.5785 1278.5042 1316.1449 1360.8773 1420.7828 1427.2394 1447.8810 1449.2590 3084.6746 3085.2051 3174.2877 3174.7106
redmass: 19.2931 29.8587 24.0522 23.9736 19.7768 23.0332 23.0497 14.5635 15.8790 11.3893 15.2439 26.5782 13.3675 17.3807 13.5315 6.6965 3.6552 6.4659 7.7760 16.7385 8.6494 9.5877 9.9843 7.2045 8.3618 11.9811 11.1449 5.7873 9.3391 7.1549 4.4704 8.5701 10.1764 5.9051 11.1327 2.4886 13.9856 1.8527 2.3823 6.6794 7.3453 6.6504 1.3580 1.4837 5.7766 1.1674 1.1711 7.4179 6.3320 1.1116 1.1229 12.6285 10.0079 1.0562 1.0562 1.1117 1.1116
irintensity: 0.1512 0.1094 0.4338 0.0874 0.1328 1.2641 0.2403 0.2802 3.3289 3.6937 0.2100 0.7962 5.5082 0.1109 2.9146 0.2645 7.6408 0.6598 1.8593 2.3777 4.1232 19.3759 0.4675 43.2455 11.6870 0.7701 90.8948 63.0295 100.0220 10.8068 13.0865 32.8786 12.5594 46.9038 3.1022 15.9816 5.2794 0.5280 62.7027 1.8989 3.8913 3.7312 11.6563 51.9750 240.6025 4.5034 1.1172 1.2411 46.9278 2.2589 26.5305 340.4752 321.5829 4.4154 0.0155 0.0662 0.3624
temp: 298.150 k
press: 1.00000 atm
elementType: 17 17 17 17 17 17 17 7 7 7 6 6 6 6 6 6 6 1 1 1 1
symmnumber: 1
zpe: 280798.9 jmol-1
zpe.correction: 0.106951 hartree
zpe.thermalcorrener: 0.125230 hartree
zpe.thermalcorrenthalpy: 0.126174 hartree
zpe.thermalcorrgfe: 0.056071 hartree
zpe.sumelectzpe: -3652.526244 hartree
zpe.sumelectthermal: -3652.507964 hartree
zpe.sumelectthermalent: -3652.507020 hartree
zpe.sumelectthermalfe: -3652.577124 hartree
dipole: -0.0001 -2.1827 0.0004
dipole: 2.1827
quadrupole: -150.2363 -145.8769 -149.6843
quadrupole: 0.0014 2.8568 -0.0013
quadrupole: -1.6371 2.7222 -1.0851 0.0014 2.8568 -0.0013
hfenergy: -3652.6331947 hartree
pointgroup: C01 [X(C7H4Cl7N3)]
dipole: -0.0001956 -0.8587215 -0.0001621 debye
dipolederiv: -0.2865778 0.0727931 -0.1450545 0.0557635 -0.2170291 -0.0731452 -0.1108947 0.0131432 -0.6674216 -0.4021119 -0.1139862 0.2218044 -0.118192 -0.1885202 0.1160452 0.1595329 0.1159676 -0.253979 -0.2866279 -0.0727468 -0.1450599 -0.0557286 -0.2170063 0.0731875 -0.1109201 -0.0130484 -0.6674513 -0.4020098 0.1140293 0.2217575 0.1182431 -0.1885347 -0.1160902 0.1595048 -0.1159853 -0.2539755 -0.1758591 -0.0021171 -0.0740366 0.0101808 -0.2549275 -0.1264827 -0.0721347 -0.1722365 -0.4223048 -0.175895 0.0021512 -0.0740579 -0.0101851 -0.2549311 0.1265021 -0.072124 0.1722456 -0.4222681 -0.0510591 -0.0000543 -0.0006154 -0.0000776 -0.9491214 -0.0005111 0.0057311 -0.0015253 -0.0252225 -1.2856157 0.0000316 -0.0479249 0.0000687 -0.4997345 -0.0000644 -0.0501452 -0.0002236 -0.0542977 -0.6259849 -0.5339239 -0.0271427 -0.2642028 -1.1251267 -0.0453326 -0.0399872 0.004253 -0.1042335 -0.6258296 0.5338247 -0.0262879 0.2640302 -1.125353 0.0446708 -0.040411 -0.0046357 -0.1041779 0.6988416 0.0728936 -0.1747094 0.159977 0.489157 -0.0205929 -0.248894 -0.1277605 0.9342331 0.6988186 -0.0728977 -0.174591 -0.1600076 0.489234 0.0206127 -0.2489515 0.1278606 0.9343105 0.9846694 -0.1669452 0.0874695 -0.2643257 0.6777321 -0.0295813 0.1826724 -0.0267756 0.0436828 0.9847526 0.16686 0.0874177 0.2642741 0.6775614 0.0296882 0.1826094 0.0271144 0.0437201 0.0233138 0.005253 0.1352803 0.0273397 0.0807383 0.1766424 0.1617367 0.2422028 0.4757789 0.0233712 -0.0052773 0.1352619 -0.0273531 0.0807236 -0.1766775 0.1617429 -0.2422439 0.4756936 0.6970843 0.0000883 0.0530841 0.0001671 2.1556922 0.0011152 0.0299145 0.0016411 0.1101994 0.094915 -0.0764687 0.0115373 -0.0904314 0.1002185 -0.0217271 0.0095697 -0.0267019 -0.0312907 0.0084466 0.0593977 -0.0378376 0.0389276 0.0845122 -0.0316805 -0.0340603 -0.0300161 0.0101384 0.0949527 0.0764782 0.0115398 0.0904382 0.1001831 0.0217364 0.0095696 0.0266942 -0.0312939 0.0084051 -0.0593834 -0.0378347 -0.038906 0.084532 0.031685 -0.0340612 0.0300305 0.0101599 unknown
polarizability: 172.8749221|-0.0030635|169.3830379|6.8961557|0.0289296|153.4788864 unknown
InChI: InChI=1S/C7H4Cl7N3/c8-1-6(11,12)3-15-4(7(13,14)2-9)17-5(10)16-3/h1-2H2
charge 0 multiplicity 1
21 atoms
Cl 2.942571 -0.41748 1.970501
Cl 3.788205 0.329094 -0.865854
Cl -2.94264 -0.416701 -1.970728
Cl -3.788043 0.329968 0.865671
Cl 1.859181 -2.250694 -1.984154
Cl -1.859317 -2.250251 1.983793
Cl 0.000495 4.069757 0.001709
N  -0.000008 -0.419373 -0.000312
N  -1.208764 1.669964 -0.039853
N  1.209268 1.669657 0.039607
C  2.452527 -0.480568 0.126501
C  -2.452568 -0.479951 -0.126731
C  1.151711 0.308153 0.034661
C  -1.151557 0.308451 -0.034913
C  2.346218 -1.969561 -0.19405
C  -2.346575 -1.968977 0.193768
C  0.000353 2.277752 -0.000765
H  1.557403 -2.433771 0.413227
H  3.318503 -2.459617 -0.053063
H  -1.557962 -2.433362 -0.413639
H  -3.3190 -2.458793 0.052922
