program: Gaussian 09
title: 000035645
version: EM64L-G09RevD.01
frameworkgroup: C1[X(C5H3Cl4N3)]
method: RPBEPBE
basis: SDD
operation: Freq
keyword: #p
keyword: freq=noraman
keyword: PBEPBE/SDD
title: #p freq=noraman PBEPBE/SDD
converged: NO NO NO YES
title: Mulliken charges:
elementType: Cl Cl Cl Cl N N N C C C C C H H H
charge: 0.054608 0.054637 0.074006 0.068966 0.056290 0.133484 0.152963 -0.489126 0.271956 -0.584671 -0.273908 -0.275965 0.248249 0.248265 0.260245
chargesum: 0.00000
title: Mulliken charges with hydrogens summed into heavy atoms:
elementType: Cl Cl Cl Cl N N N C C C C C
charge: 0.054608 0.054637 0.074006 0.068966 0.056290 0.133484 0.152963 -0.489126 0.271956 0.172088 -0.273908 -0.275965
polarizability: 1.33191502e+02 6.08088170e+00 1.35972157e+02 -5.48284785e-03 -5.25984900e-03 7.68234632e+01
1716.lowfreq: -5.8287 -4.5039 0.0034 0.0036 0.0038 7.0120 15.6316 77.9482 119.1133
frequency: 15.3752 77.9453 119.1131 141.7502 152.0136 169.4916 208.1562 241.4702 276.0153 278.0892 311.7923 325.2462 392.2089 433.6127 441.3068 532.8178 582.0036 633.8780 654.6218 702.3860 790.6014 817.1790 860.2334 890.3436 1074.3705 1080.8583 1126.9360 1169.3329 1202.1076 1208.4625 1332.4483 1403.0897 1415.5164 1439.1494 1452.4759 1452.5134 3017.3211 3120.5701 3133.1240
redmass: 12.3116 19.8865 12.6750 15.7224 14.5398 25.4221 11.7580 8.7494 6.5074 1.0261 6.8440 3.9326 15.3994 11.3766 13.8914 7.8517 7.1856 12.3198 5.6371 7.6204 13.1958 11.7277 4.4275 13.8711 1.5218 2.6023 3.6038 12.4174 10.9205 12.2402 8.8760 1.2789 6.8164 8.1698 1.0420 1.1321 1.0352 1.1000 1.1016
irintensity: 0.8474 0.0621 1.4043 0.0104 0.0900 0.0969 1.7330 0.0107 0.5510 0.0086 3.5602 2.5794 4.0713 15.0310 0.5627 11.6207 65.9338 0.0887 60.6034 33.6004 144.5435 0.2156 21.3252 1.3398 51.4538 13.0910 16.7395 5.3640 254.0407 121.6495 46.2480 98.7249 422.8339 420.3353 9.6191 70.4792 0.7690 4.4764 7.2363
temp: 298.150 k
press: 1.00000 atm
elementType: 17 17 17 17 7 7 7 6 6 6 6 6 1 1 1
symmnumber: 1
zpe: 207408.1 jmol-1
zpe.correction: 0.078998 hartree
zpe.thermalcorrener: 0.090933 hartree
zpe.thermalcorrenthalpy: 0.091877 hartree
zpe.thermalcorrgfe: 0.038262 hartree
zpe.sumelectzpe: -2195.918602 hartree
zpe.sumelectthermal: -2195.906667 hartree
zpe.sumelectthermalent: -2195.905723 hartree
zpe.sumelectthermalfe: -2195.959338 hartree
dipole: 0.3940 -2.0620 -0.0012
dipole: 2.0993
quadrupole: -101.6075 -96.6919 -95.3774
quadrupole: -4.9357 -0.0027 -0.0007
quadrupole: -3.7152 1.2003 2.5149 -4.9357 -0.0027 -0.0007
hfenergy: -2195.9976 hartree
pointgroup: C01 [X(C5H3Cl4N3)]
dipole: 0.2580314 0.7846012 0.0002793 debye
dipolederiv: -0.3201034 0.0565314 0.1592008 0.0693364 -0.2368192 -0.2246741 0.1165343 -0.1626681 -0.5414015 -0.3200511 0.056581 -0.1592564 0.0693867 -0.2368782 0.2247338 -0.1165077 0.1626886 -0.5411921 -0.2774505 -0.3548748 0.0000458 -0.3898176 -0.7047589 0.0001076 0.0002059 0.0002449 -0.0263387 -0.3291071 0.3945469 -0.0001478 0.4077454 -0.6803713 0.0002576 -0.0005481 0.0007968 -0.0311248 -1.2673741 0.5439076 -0.0002094 0.2384507 -0.7384993 -0.0000147 0.0001814 0.0002098 -0.0881104 -1.2331494 -0.5479994 0.0001037 -0.3776622 -0.7265345 0.0000497 -0.0001352 0.0001698 -0.0713866 -0.5116792 0.0353681 0.0001225 0.0773083 -1.5515134 0.0004065 -0.0001116 -0.0001279 -0.0990775 0.5292502 -0.0129393 0.0000899 -0.0559078 0.6368297 -0.0000293 0.0000963 -0.0001092 1.1937433 1.1723651 -0.1015979 -0.0001026 0.0275372 0.7125676 -0.0000143 -0.0001188 -0.0001549 -0.0082789 -0.1164637 -0.0232137 -0.0000045 -0.0691322 -0.2076248 -0.0000001 -0.000021 0.0000028 -0.1188949 1.2494903 0.5237066 -0.0000934 0.521746 1.8061967 -0.0002049 -0.0000831 -0.0002548 0.0968552 1.2699364 -0.59314 0.0002474 -0.6063062 1.7427178 -0.0006127 0.0004857 -0.0007935 0.1227377 0.1189708 0.015279 0.0551621 0.0313239 0.0405006 -0.0636603 0.0601764 -0.0497782 -0.0046977 0.1189673 0.0153067 -0.0551773 0.0313563 0.0404832 0.0636612 -0.0601805 0.0497768 -0.0046268 -0.0836016 -0.0074622 0.0000191 0.024635 0.103704 -0.000006 0.000026 -0.0000029 0.1217937 unknown
polarizability: 131.6868735|-5.525337|137.4767803|0.0058756|-0.0195061|76.8234689 unknown
InChI: InChI=1S/C5H3Cl4N3/c1-5(8,9)2-10-3(6)12-4(7)11-2/h1H3
charge 0 multiplicity 1
15 atoms
Cl 2.613379 -0.791703 -1.531391
Cl 2.613747 -0.79215 1.530764
Cl -2.291951 -2.736734 0.000286
Cl -2.49622 2.624246 -0.000938
N  -0.190926 1.237299 0.000054
N  -0.099177 -1.181113 0.000092
N  -2.239128 -0.050542 0.000099
C  2.015532 0.134277 -0.000084
C  0.490633 0.052853 0.000022
C  2.605227 1.534741 0.00004
C  -1.448639 -1.158539 -0.000179
C  -1.542046 1.10872 0.000609
H  2.270668 2.086376 0.893668
H  2.27047 2.086625 -0.893358
H  3.70413 1.468043 -0.000085
