program: Gaussian 09
title: 000035669
version: EM64L-G09RevD.01
frameworkgroup: C1[X(C15H8ClN5O4)]
method: RPBEPBE
basis: SDD
operation: Freq
keyword: #p
keyword: freq=noraman
keyword: PBEPBE/SDD
title: #p freq=noraman PBEPBE/SDD
converged: YES YES NO NO
title: Mulliken charges:
elementType: Cl O O O O N N N N N C C C C C C C C C C C C C C C H H H H H H H H
charge: 0.029318 -0.198771 -0.198771 -0.188041 -0.188041 -0.051396 0.046212 0.046214 0.022553 0.022553 0.337242 0.337241 -0.007336 -0.007334 -0.466219 -0.466219 -0.339521 -0.339520 0.378528 0.378526 -0.190565 -0.190566 -0.358729 -0.358727 -0.361676 0.321912 0.321914 0.292150 0.292151 0.248380 0.248381 0.294079 0.294078
chargesum: 0.00000
title: Mulliken charges with hydrogens summed into heavy atoms:
elementType: Cl O O O O N N N N N C C C C C C C C C C C C C C C
charge: 0.029318 -0.198771 -0.198771 -0.188041 -0.188041 -0.051396 0.046212 0.046214 0.022553 0.022553 0.337242 0.337241 -0.007336 -0.007334 -0.144307 -0.144305 -0.047371 -0.047369 0.378528 0.378526 0.057815 0.057815 -0.064649 -0.064649 -0.361676
polarizability: 3.56289868e+02 -6.58950267e-04 3.19371207e+02 -1.36423297e-01 -1.82119444e-02 8.02079198e+01
1716.lowfreq: -4.1403 -3.4184 -0.0010 -0.0009 -0.0003 3.6006 14.6310 27.3460 38.7669
frequency: 14.6095 27.3395 38.7669 44.6206 48.8282 70.3450 93.2725 105.1860 147.1898 153.9846 165.6375 176.5301 191.7178 217.4120 237.7974 241.5916 274.3794 329.4762 359.9024 390.2635 390.6011 421.4363 426.3785 441.8984 469.4207 493.7371 501.0044 528.9967 580.0224 629.3732 640.1811 642.3773 653.1495 662.5260 686.2440 696.1563 696.5898 706.0852 747.3689 764.3173 778.4377 817.6415 836.8410 849.7950 854.6850 877.2006 909.3681 971.2955 975.1295 975.1530 978.1875 988.4520 989.6600 1019.9007 1020.1452 1060.3668 1075.1866 1084.5913 1086.4460 1105.1114 1126.1755 1173.3708 1175.2368 1177.5814 1199.2890 1214.8653 1217.9920 1275.4663 1277.4172 1329.1449 1375.4505 1378.0101 1381.3550 1398.1074 1403.8769 1415.5990 1434.2980 1446.1417 1459.3443 1482.1810 1494.9273 1584.4821 1585.8660 1615.3345 1616.6073 3157.7637 3157.7922 3176.8577 3176.9107 3187.7819 3188.0963 3190.2475 3192.3934
redmass: 8.0238 7.6537 11.5578 14.1366 14.0796 7.6917 10.8183 6.5964 11.7121 16.5003 5.8944 6.0267 11.8250 6.0002 5.4906 8.5235 7.6913 6.8385 10.9011 11.0310 8.2640 3.1586 3.2424 12.7671 5.7860 5.7513 9.6063 6.4438 7.1150 8.0371 7.3771 8.1809 5.6051 9.8030 10.8409 2.2520 2.6024 8.9607 5.3223 11.7848 12.0193 2.4287 1.5054 2.5417 8.5572 6.7935 13.3153 1.4970 1.3926 1.3803 1.5010 6.2187 6.1822 1.3730 1.3748 1.9713 1.6661 1.9208 1.5871 2.8766 7.6445 1.1887 1.1732 6.9818 5.4579 8.1313 11.2494 1.4163 1.4122 4.4605 6.3812 12.7342 6.1171 4.9872 7.9743 9.8648 3.1803 3.3540 8.3668 3.3987 4.2409 6.9648 6.9900 7.0533 7.1125 1.0884 1.0884 1.0933 1.0933 1.0959 1.0972 1.0946 1.0928
irintensity: 0.0000 4.1379 0.1660 0.5558 0.0000 0.7178 3.5679 0.0000 0.6111 0.3523 0.0000 1.6845 0.7138 0.0000 0.0460 0.5572 2.7132 0.8347 0.4240 10.1279 0.1326 0.0000 0.9402 1.9908 0.0004 3.7188 6.3163 0.1070 2.7603 29.1873 0.1791 0.0145 0.0000 17.6347 99.7589 81.5268 0.0004 9.7633 0.0000 0.7046 5.5714 75.0539 0.0002 9.9907 89.6488 0.3268 6.5930 0.0003 0.0030 1.8079 30.3145 4.7714 0.1386 0.0000 2.3391 82.0394 42.4265 4.0516 48.3890 1.7582 0.0437 39.5560 97.6774 18.6150 363.9097 40.9607 265.8174 18.4959 23.6617 120.8684 0.0418 189.6323 284.4319 37.6469 50.0181 120.0031 36.1973 205.2339 1107.7900 82.8370 14.0232 0.0156 21.4815 31.2561 25.7419 12.0644 1.5860 8.6792 1.3188 0.7935 2.7070 14.8308 4.1695
temp: 298.150 k
press: 1.00000 atm
elementType: 17 8 8 8 8 7 7 7 7 7 6 6 6 6 6 6 6 6 6 6 6 6 6 6 6 1 1 1 1 1 1 1 1
symmnumber: 1
zpe: 562402.0 jmol-1
zpe.correction: 0.214208 hartree
zpe.thermalcorrener: 0.234478 hartree
zpe.thermalcorrenthalpy: 0.235422 hartree
zpe.thermalcorrgfe: 0.161508 hartree
zpe.sumelectzpe: -1609.227161 hartree
zpe.sumelectthermal: -1609.206891 hartree
zpe.sumelectthermalent: -1609.205947 hartree
zpe.sumelectthermalfe: -1609.279861 hartree
dipole: 0.0001 6.6862 -0.0067
dipole: 6.6862
quadrupole: -126.1755 -190.3317 -148.0830
quadrupole: -0.0004 -0.0554 0.0098
quadrupole: 28.6879 -35.4683 6.7804 -0.0004 -0.0554 0.0098
hfenergy: -1609.4413688 hartree
pointgroup: C01 [X(C15H8Cl1N5O4)]
dipole: 0.0026151 -2.6280845 -0.113683 debye
polarizability: 356.2898896|0.0344025|318.9436218|0.0536744|10.103906|80.635484 unknown
InChI: InChI=1S/C15H8ClN5O4/c16-15-18-13(9-3-1-5-11(7-9)20(22)23)17-14(19-15)10-4-2-6-12(8-10)21(24)25/h1-8H
charge 0 multiplicity 1
33 atoms
Cl 0.005052 -5.270244 -0.344257
O  4.892715 3.377327 0.014071
O  -4.89995 3.367249 0.019971
O  2.611901 3.419414 0.019105
O  -2.619241 3.413657 0.02993
N  0.000534 -0.771292 -0.15583
N  -1.205984 -2.869912 -0.245212
N  1.21127 -2.86749 -0.244813
N  3.740062 2.797444 -0.008493
N  -3.746151 2.789617 -0.001653
C  2.455622 -0.761559 -0.156349
C  -2.454566 -0.766487 -0.156656
C  1.166326 -1.488207 -0.186456
C  -1.163818 -1.490542 -0.18678
C  2.471811 0.653916 -0.097554
C  -2.473603 0.648812 -0.09457
C  3.679844 -1.484394 -0.186382
C  -3.677331 -1.491653 -0.189794
C  3.715471 1.308945 -0.070579
C  -3.718581 1.301333 -0.067493
C  4.911733 -0.799176 -0.158104
C  -4.910596 -0.808921 -0.161534
C  4.942954 0.610464 -0.099613
C  -4.944653 0.600514 -0.099756
C  0.003244 -3.464248 -0.26973
H  1.540089 1.223905 -0.073657
H  -1.543022 1.220553 -0.068231
H  3.639494 -2.576448 -0.231503
H  -3.634777 -2.583526 -0.237203
H  5.849665 -1.362039 -0.181468
H  -5.847395 -1.373558 -0.187427
H  5.880926 1.171542 -0.076345
H  -5.883747 1.159705 -0.076334
