program: Gaussian 09
title: 000035641
version: EM64L-G09RevD.01
frameworkgroup: C1[X(C4H2BrCl2N3)]
method: RPBEPBE
basis: SDD
operation: Freq
keyword: #p
keyword: freq=noraman
keyword: PBEPBE/SDD
title: #p freq=noraman PBEPBE/SDD
converged: YES YES NO NO
title: Mulliken charges:
elementType: Br Cl Cl N N N C C C C H H
charge: 0.042000 0.066506 0.066506 0.069956 0.069958 0.148406 0.186541 -0.768933 -0.252142 -0.252145 0.311674 0.311674
chargesum: 0.00000
title: Mulliken charges with hydrogens summed into heavy atoms:
elementType: Br Cl Cl N N N C C C C
charge: 0.042000 0.066506 0.066506 0.069956 0.069958 0.148406 0.186541 -0.145585 -0.252142 -0.252145
polarizability: 1.24508434e+02 1.95921104e-03 1.16165167e+02 1.00386938e+00 -1.55725973e-03 5.72726021e+01
1716.lowfreq: -5.9311 0.0029 0.0032 0.0032 6.6530 7.9744 35.4024 64.1051 141.3915
frequency: 35.3548 64.1037 141.3915 153.1558 187.4048 220.4383 240.5864 384.3209 424.2438 464.2167 511.8045 586.8394 632.3264 693.3445 784.9352 815.0632 886.5966 892.1703 906.5158 1087.7041 1178.1648 1206.7694 1233.6207 1234.4555 1342.6818 1423.4282 1425.2403 1450.0667 3090.0819 3188.2271
redmass: 11.5866 24.1592 16.2708 14.5314 19.2490 18.2551 3.0884 22.4332 11.6454 5.3840 7.8384 7.3299 12.3562 8.5248 8.6681 10.8438 12.3630 1.6707 8.7808 1.5242 8.5868 12.3251 1.1553 3.2027 5.9113 8.6644 1.4410 4.7443 1.0558 1.1129
irintensity: 0.6947 0.4915 0.0860 0.0014 0.0283 0.8792 4.1875 5.2473 6.9547 2.6572 6.5316 48.5886 0.0324 6.1227 129.2623 6.3282 8.5606 29.5852 7.1875 3.9120 39.6869 101.6114 8.5216 244.1485 29.9991 511.3080 71.3934 420.5422 4.0082 0.1506
temp: 298.150 k
press: 1.00000 atm
elementType: 35 17 17 7 7 7 6 6 6 6 1 1
symmnumber: 1
zpe: 160809.5 jmol-1
zpe.correction: 0.061249 hartree
zpe.thermalcorrener: 0.070605 hartree
zpe.thermalcorrenthalpy: 0.071549 hartree
zpe.thermalcorrgfe: 0.023166 hartree
zpe.sumelectzpe: -1250.709066 hartree
zpe.sumelectthermal: -1250.699710 hartree
zpe.sumelectthermalent: -1250.698766 hartree
zpe.sumelectthermalfe: -1250.747149 hartree
dipole: 0.7280 0.0000 1.8002
dipole: 1.9419
quadrupole: -85.6451 -84.9026 -75.4422
quadrupole: 0.0001 1.2868 -0.0004
quadrupole: -3.6485 -2.9059 6.5544 0.0001 1.2868 -0.0004
hfenergy: -1250.7703155 hartree
pointgroup: C01 [X(C4H2Br1Cl2N3)]
dipole: 0.3679271 0.0000693 0.6695568 debye
dipolederiv: -0.3968918 -0.0000273 0.0825642 -0.0000105 -0.0679935 -0.0000017 0.1851478 0.0000112 -0.2090304 -0.2926064 -0.3738762 -0.0303139 -0.3860091 -0.7092372 -0.0462643 -0.0520964 -0.0760141 -0.0406856 -0.2926979 0.3738951 -0.030384 0.3860599 -0.7091086 0.0463918 -0.0522618 0.0762524 -0.0407248 -1.1997469 0.5069182 -0.1128992 0.2924591 -0.7566315 -0.014839 -0.2392221 0.1051976 -0.1191262 -1.1996863 -0.5070285 -0.1127598 -0.2926234 -0.756769 0.0149357 -0.2392475 -0.1051048 -0.1190997 -0.4876835 0.0000767 -0.0495553 0.0001057 -1.5865052 0.0001169 -0.0767453 0.0000505 -0.105161 1.2564128 0.0000599 -0.0302832 0.0000568 0.8483995 -0.0000653 0.092465 -0.0000741 -0.0095325 0.1134751 -0.000003 -0.159982 0.0001185 0.0523127 -0.0000518 -0.152439 0.0000009 0.3557849 1.2001299 0.5379492 0.1587405 0.5464806 1.8013478 0.0416747 0.2319802 0.1092246 0.1445168 1.2002771 -0.5379681 0.1588538 -0.5465432 1.8011678 -0.0419535 0.2321254 -0.1095414 0.1445745 0.0495347 -0.016976 0.0629942 0.0308322 0.0415204 0.0630765 0.0351875 0.0537381 -0.0007859 0.0494833 0.0169799 0.0630247 -0.0309267 0.0414969 -0.06302 0.0351061 -0.0537411 -0.0007303 unknown
polarizability: 123.8089169|0.0017951|116.1651668|-6.8957225|-0.0071656|57.9721192 unknown
InChI: InChI=1S/C4H2BrCl2N3/c5-1-2-8-3(6)10-4(7)9-2/h1H2
charge 0 multiplicity 1
12 atoms
Br 3.448722 0.000221 -1.005269
Cl -1.884439 -2.68315 -0.218963
Cl -1.884816 2.682909 -0.219451
N  0.314427 1.213699 0.278104
N  0.314623 -1.213544 0.278231
N  -1.724281 -0.000108 -0.203537
C  0.941758 0.00014 0.413403
C  2.403661 0.000269 0.733683
C  -1.001128 -1.134833 -0.028827
C  -1.00135 1.134741 -0.028817
H  2.703429 -0.917095 1.255538
H  2.703295 0.917751 1.255407
