program: Gaussian 09
title: 000035644
version: EM64L-G09RevD.01
frameworkgroup: C1[X(C4HCl2I2N3)]
method: RPBEPBE
basis: SDD
operation: Freq
keyword: #p
keyword: freq=noraman
keyword: PBEPBE/SDD
title: #p freq=noraman PBEPBE/SDD
converged: NO NO NO NO
title: Mulliken charges:
elementType: I I Cl Cl N N N C C C C H
charge: 0.193554 0.193564 0.070943 0.070355 0.053072 0.121066 0.151002 0.285954 -1.024013 -0.249597 -0.257271 0.391369
chargesum: 0.00000
title: Mulliken charges with hydrogens summed into heavy atoms:
elementType: I I Cl Cl N N N C C C C
charge: 0.193554 0.193564 0.070943 0.070355 0.053072 0.121066 0.151002 0.285954 -0.632643 -0.249597 -0.257271
polarizability: 1.59482749e+02 6.33135171e-03 1.22622660e+02 -1.05729034e+01 -1.38550388e-02 1.23766137e+02
1716.lowfreq: -0.0012 -0.0010 0.0017 2.0541 4.8834 7.7152 17.1707 46.5547 85.1523
frequency: 16.8857 46.5477 85.1523 100.9619 139.4900 152.5033 162.5918 202.6102 219.9639 386.1310 400.9962 435.8874 516.9696 605.9868 608.3114 631.8282 693.2855 796.2428 815.4758 886.4102 911.9801 1130.3663 1130.7820 1179.9574 1206.6725 1252.2648 1334.0918 1419.9082 1436.8428 3154.1785
redmass: 39.0521 47.7417 24.5479 37.6216 16.2554 14.5677 40.6390 15.6065 21.8920 19.2182 13.6752 16.6411 9.6624 6.4641 8.3520 12.3615 10.7042 12.4424 12.3055 13.2062 8.5870 2.6386 1.0572 8.6284 12.1213 2.1235 11.5131 8.8088 11.4880 1.0868
irintensity: 0.0505 0.0330 0.1375 0.1196 0.0176 0.2216 0.0011 0.6331 0.1326 4.4244 2.5539 6.4611 79.2013 49.8195 9.2101 0.0455 34.9711 148.0307 0.0339 4.6728 20.1432 14.9491 39.0482 72.8699 136.3588 256.0723 7.2855 542.1136 576.6542 5.4659
temp: 298.150 k
press: 1.00000 atm
elementType: 53 53 17 17 7 7 7 6 6 6 6 1
symmnumber: 1
zpe: 131955.7 jmol-1
zpe.correction: 0.050259 hartree
zpe.thermalcorrener: 0.061413 hartree
zpe.thermalcorrenthalpy: 0.062357 hartree
zpe.thermalcorrgfe: 0.007397 hartree
zpe.sumelectzpe: -1259.584395 hartree
zpe.sumelectthermal: -1259.573242 hartree
zpe.sumelectthermalent: -1259.572297 hartree
zpe.sumelectthermalfe: -1259.627258 hartree
dipole: -0.9465 0.0002 -0.7390
dipole: 1.2008
quadrupole: -110.8266 -100.7740 -108.6635
quadrupole: 0.0015 -0.0697 0.0042
quadrupole: -4.0719 5.9807 -1.9088 0.0015 -0.0697 0.0042
hfenergy: -1259.6346546 hartree
pointgroup: C01 [X(C4H1Cl2I2N3)]
dipole: -0.3652307 -0.2996597 0.0001374 debye
dipolederiv: -0.1607813 -0.0144733 -0.2335352 0.0241247 0.0484329 0.1193408 -0.15489 0.0423087 -0.486548 -0.1605739 -0.0145123 0.2335401 0.0240689 0.0484578 -0.1192925 0.1546783 -0.0422616 -0.4863666 -0.1550671 -0.219707 -0.0000067 -0.3069859 -0.8361964 -0.0001057 -0.0001484 -0.0002334 -0.0300175 -0.5549034 0.4464466 0.000184 0.4709391 -0.5016317 -0.000199 0.000759 -0.0006728 -0.0301672 -1.6216463 0.4099233 0.0000564 0.1612219 -0.5959083 0.0000705 -0.0000392 -0.0002568 -0.1246614 -1.1192916 -0.5637229 -0.0000729 -0.5375499 -0.9457399 -0.0000803 0.0001754 -0.0001298 -0.0759259 -0.6494858 0.2640728 -0.0000294 0.2840311 -1.4816428 -0.0004439 0.0001362 0.0001194 -0.1109496 1.5109923 -0.0153566 0.0001919 0.3072839 0.7951551 0.0000828 -0.0000097 0.000169 -0.0450074 0.0590016 -0.0672482 0.0000062 -0.1587563 -0.0787313 -0.0001798 0.0000747 0.0000172 1.2582708 1.1480382 0.3386574 -0.0000325 0.4405394 1.9858491 0.0002128 0.0000184 0.000233 0.0989443 1.6788324 -0.662531 -0.0002947 -0.6810828 1.4971417 0.0005285 -0.0007698 0.0006978 0.1592549 0.024885 0.0984512 -0.0000072 -0.0278342 0.0648137 0.0000658 0.0000152 0.0000091 -0.1268263 unknown
polarizability: 159.9730567|-9.6971013|123.2758449|-0.0038469|0.0140451|122.6226447 unknown
InChI: InChI=1S/C4HCl2I2N3/c5-3-9-2(1(7)8)10-4(6)11-3/h1H
charge 0 multiplicity 1
12 atoms
I  -3.07106 -0.108423 -1.847462
I  -3.07137 -0.108419 1.847235
Cl 1.471695 3.013836 0.000258
Cl 2.850592 -2.169149 -0.000972
N  0.295717 -1.327466 0.000071
N  -0.327701 1.017383 0.000129
N  2.009342 0.382168 0.000091
C  -0.631751 -0.317748 0.000069
C  -2.068711 -0.76212 -0.00003
C  0.994886 1.288704 -0.000133
C  1.585402 -0.90307 0.000578
H  -2.11934 -1.857195 -0.000034
