program: Gaussian 09
title: 000035642
version: EM64L-G09RevD.01
frameworkgroup: C1[X(C4HBr2Cl2N3)]
method: RPBEPBE
basis: SDD
operation: Freq
keyword: #p
keyword: freq=noraman
keyword: PBEPBE/SDD
title: #p freq=noraman PBEPBE/SDD
converged: NO NO NO YES
title: Mulliken charges:
elementType: Br Br Cl Cl N N N C C C C H
charge: 0.121669 0.121678 0.076206 0.074867 0.049149 0.122999 0.152157 0.263120 -0.854999 -0.252421 -0.255863 0.381438
chargesum: 0.00000
title: Mulliken charges with hydrogens summed into heavy atoms:
elementType: Br Br Cl Cl N N N C C C C
charge: 0.121669 0.121678 0.076206 0.074867 0.049149 0.122999 0.152157 0.263120 -0.473560 -0.252421 -0.255863
polarizability: 1.40976175e+02 9.51677945e+00 1.21311375e+02 -7.39345902e-03 -3.02705795e-05 9.28933131e+01
1716.lowfreq: -2.5567 0.0011 0.0023 0.0024 5.7534 7.0688 19.1543 56.2505 96.9047
frequency: 19.0463 56.2497 96.9044 128.5191 140.9514 152.6793 189.1845 216.9426 235.9964 388.3761 414.5849 438.2999 558.0663 616.9991 633.0220 647.1380 701.9517 798.3740 817.9001 887.7919 913.9259 1143.1970 1170.4004 1176.3436 1207.9437 1258.8066 1334.8106 1424.1263 1439.9895 3155.4100
redmass: 36.7412 39.4736 24.1134 36.3012 16.1656 14.5868 32.2592 16.4359 25.2730 21.1141 13.8905 16.0203 10.5460 9.8691 12.3586 6.0419 10.3045 12.2177 12.2055 13.3771 7.9346 2.9437 1.0608 8.4990 11.9220 2.0086 10.9066 8.6864 11.4881 1.0880
irintensity: 0.1730 0.0621 0.4622 0.0514 0.0058 0.2381 0.0448 0.5244 0.3616 5.1631 4.6771 4.2725 87.4286 61.2380 0.0001 21.0922 51.8837 138.9613 0.0290 4.4787 6.8624 16.6633 24.8307 80.5985 112.9390 246.6999 20.3151 499.1442 493.8986 2.0852
temp: 298.150 k
press: 1.00000 atm
elementType: 35 35 17 17 7 7 7 6 6 6 6 1
symmnumber: 1
zpe: 133766.0 jmol-1
zpe.correction: 0.050949 hartree
zpe.thermalcorrener: 0.061830 hartree
zpe.thermalcorrenthalpy: 0.062774 hartree
zpe.thermalcorrgfe: 0.009605 hartree
zpe.sumelectzpe: -1263.487692 hartree
zpe.sumelectthermal: -1263.476811 hartree
zpe.sumelectthermalent: -1263.475867 hartree
zpe.sumelectthermalfe: -1263.529035 hartree
dipole: 0.2408 -0.9685 -0.0013
dipole: 0.9980
quadrupole: -100.3142 -96.9365 -92.4336
quadrupole: -0.9363 -0.0023 -0.0045
quadrupole: -3.7528 -0.3751 4.1279 -0.9363 -0.0023 -0.0045
hfenergy: -1263.5386407 hartree
pointgroup: C01 [X(C4H1Br2Cl2N3)]
dipole: -0.0952502 -0.3809108 0.0002296 debye
dipolederiv: -0.2609797 -0.008286 -0.2509098 0.0407351 -0.0139285 0.1489955 -0.1828585 0.0464571 -0.5655378 -0.2609841 -0.0083329 0.2510016 0.040717 -0.0138989 -0.148966 0.1828005 -0.0464018 -0.5654044 -0.1542449 -0.2387483 -0.0000186 -0.2923946 -0.8187652 -0.0001267 -0.000187 -0.00027 -0.026432 -0.5038373 0.4452719 0.0003029 0.4509173 -0.5213647 -0.0003522 0.0011215 -0.0011227 -0.0271073 -1.4837373 0.4353951 0.0003219 0.13715 -0.6161368 0.0000896 -0.0002215 -0.0003706 -0.11765 -1.0709047 -0.5671049 -0.0000553 -0.4475455 -0.9144867 -0.0000527 0.0002167 -0.0002158 -0.0676029 -0.5867939 0.2450672 -0.0000992 0.2625463 -1.4993902 -0.0006432 0.0002035 0.0002316 -0.1034991 1.2932564 -0.0358904 0.0000562 0.1976972 0.7956835 0.0000403 -0.0000302 0.0002446 -0.0217551 0.3392835 -0.0502478 -0.0000526 -0.1267253 0.0567488 -0.0000766 0.0000016 0.0000431 1.3320564 1.0956816 0.3640689 0.000014 0.4112793 1.9720313 0.0002178 -0.0000118 0.0002603 0.1006196 1.5628838 -0.6684314 -0.0005713 -0.6622402 1.5283142 0.000882 -0.0010268 0.0011248 0.1439519 0.0303767 0.0872387 0.0000103 -0.0121366 0.0451932 -0.0000079 -0.0000079 0.0000194 -0.0816393 unknown
polarizability: 140.9503405|-9.5433849|121.3371898|-0.0186194|0.0227638|92.8933328 unknown
InChI: InChI=1S/C4HBr2Cl2N3/c5-1(6)2-9-3(7)11-4(8)10-2/h1H
charge 0 multiplicity 1
12 atoms
Br -3.010475 -0.050739 -1.666227
Br -3.010955 -0.050757 1.665752
Cl 1.529396 2.982956 0.000307
Cl 2.773088 -2.233749 -0.001445
N  0.240941 -1.325652 0.000162
N  -0.32217 1.034439 0.000186
N  1.997941 0.338594 0.000233
C  -0.656294 -0.291455 0.000074
C  -2.107786 -0.701461 -0.000113
C  1.008249 1.271999 -0.000137
C  1.542343 -0.93575 0.001043
H  -2.192677 -1.794226 -0.000136
