program: Gaussian 09
title: 000035635
version: EM64L-G09RevD.01
frameworkgroup: C1[X(C6H7Cl2N3S)]
method: RPBEPBE
basis: SDD
operation: Freq
keyword: #p
keyword: freq=noraman
keyword: PBEPBE/SDD
title: #p freq=noraman PBEPBE/SDD
converged: NO YES NO NO
title: Mulliken charges:
elementType: Cl Cl S N N N C C C C C C H H H H H H H
charge: 0.041977 0.049632 0.326707 0.102111 0.097451 0.127176 -0.347558 -0.614328 -0.668245 -0.267636 -0.251090 -0.261408 0.220228 0.220150 0.282335 0.282147 0.215886 0.228571 0.215895
chargesum: 0.00000
title: Mulliken charges with hydrogens summed into heavy atoms:
elementType: Cl Cl S N N N C C C C C C
charge: 0.041977 0.049632 0.326707 0.102111 0.097451 0.127176 0.092820 -0.049846 -0.007892 -0.267636 -0.251090 -0.261408
polarizability: 1.93137122e+02 -2.82862035e+00 1.40479859e+02 9.52277395e-02 2.12682881e-02 5.92651818e+01
1716.lowfreq: -27.5860 -3.2872 -0.0017 -0.0004 0.0029 2.0602 21.4223 31.9434 62.3893
frequency: -10.9496 30.8052 62.3803 104.5420 133.8557 152.9048 167.8930 181.0145 185.0610 224.4218 248.8383 331.1704 375.0346 427.4141 445.3124 486.4068 616.1843 622.0690 685.4856 744.4700 781.5531 782.8735 784.4503 853.5277 880.0394 902.3267 1046.4159 1061.1151 1105.7710 1149.2869 1183.3617 1215.4631 1220.7043 1235.3082 1261.5154 1286.7638 1336.0144 1382.6342 1389.0528 1437.2619 1443.4507 1474.4201 1477.3190 1485.4618 2982.4670 2992.2747 3041.7206 3044.6276 3081.1748 3085.8562 3125.3823
redmass: 2.3455 2.4876 5.0516 3.3137 14.8154 13.7425 11.0004 9.5318 7.7704 1.0924 5.6990 4.1884 21.5252 17.4583 15.7857 11.7057 12.2524 12.3148 5.5881 1.0820 14.0147 13.5344 12.7002 1.1878 13.2608 1.9047 2.9733 1.1873 2.2141 10.8104 11.0923 1.3912 8.7724 5.4049 1.4664 1.1000 1.4406 11.0801 1.2079 1.6982 2.4375 1.0509 1.0417 1.0825 1.0354 1.0598 1.1021 1.0573 1.1015 1.0994 1.1088
irintensity: 0.0750 0.0021 0.2834 1.2372 0.1093 0.0006 0.0299 1.1831 0.2666 0.0189 3.9867 1.0936 2.8393 5.9336 1.8467 4.0815 0.1434 0.0024 9.2719 10.3623 148.8504 160.2466 2.7988 0.5021 8.6648 16.8405 4.2248 1.2368 23.0533 87.5031 254.5956 0.0160 123.5612 19.1458 0.2203 0.1952 10.7180 577.7726 3.7351 465.4046 491.9252 3.3403 14.8799 14.9148 30.8206 18.6746 4.2527 7.5604 46.2586 40.4252 16.9849
temp: 298.150 k
press: 1.00000 atm
elementType: 17 17 16 7 7 7 6 6 6 6 6 6 1 1 1 1 1 1 1
symmnumber: 1
zpe: 333488.1 jmol-1
zpe.correction: 0.127019 hartree
zpe.thermalcorrener: 0.139063 hartree
zpe.thermalcorrenthalpy: 0.140007 hartree
zpe.thermalcorrgfe: 0.086488 hartree
zpe.sumelectzpe: -1714.352002 hartree
zpe.sumelectthermal: -1714.339957 hartree
zpe.sumelectthermalent: -1714.339013 hartree
zpe.sumelectthermalfe: -1714.392532 hartree
dipole: -4.3825 0.3740 0.0047
dipole: 4.3984
quadrupole: -85.7128 -99.1251 -90.0744
quadrupole: -0.8474 -0.0238 -0.0104
quadrupole: 5.9246 -7.4876 1.5630 -0.8474 -0.0238 -0.0104
hfenergy: -1714.4790206 hartree
pointgroup: C01 [X(C6H7Cl2N3S1)]
dipole: -1.7188917 0.1796981 -0.087328 debye
dipolederiv: -0.1101982 -0.0492771 0.0064752 -0.1630257 -0.9157482 0.1428894 0.0260697 0.1466929 -0.0772895 -0.7683438 0.3810069 -0.0914873 0.4292109 -0.326161 0.0636425 -0.1007908 0.0623437 -0.06043 -0.860229 -0.1329656 -0.0053195 -0.3299557 -0.0151494 -0.0148451 0.0269942 -0.0086155 -0.0352045 -2.0356749 0.0565066 -0.0781403 0.0060227 -0.5088598 0.0700389 -0.0702449 0.0724866 -0.1146241 -1.1354737 -0.5051377 0.0492924 -0.7988125 -1.2185045 0.1694508 0.0987092 0.1790728 -0.0966665 -0.9001595 0.41765 -0.1004992 0.3032912 -1.3985172 0.2354785 -0.0814833 0.2388337 -0.138122 0.0276805 0.0134315 -0.0061536 0.2745575 0.0494273 0.0261181 -0.0494146 0.0175449 0.1475808 0.4802133 -0.16493 0.0390689 -0.3021038 0.0883717 -0.0030004 0.0630667 0.0019814 0.1311473 -0.1123782 0.0541402 -0.0158282 -0.079101 0.0521115 0.0049027 0.0059738 0.0093165 0.0971579 2.0096068 0.3163796 0.014956 0.7027427 0.8134258 -0.1103223 -0.0495008 -0.1231018 0.0518739 1.2563188 0.0847487 0.0267596 0.2992335 2.0310428 -0.3227742 -0.0100395 -0.3301493 0.1519729 2.0825901 -0.4373182 0.1472979 -0.3751604 1.3724294 -0.2345745 0.1380764 -0.2368093 0.1317891 0.0628109 0.0221056 -0.0031884 -0.0358733 -0.0533526 -0.1114258 -0.0203596 -0.1191665 -0.0228717 0.0611182 0.0160277 0.0046308 -0.0330013 0.0199368 0.094826 0.039543 0.1060698 -0.094043 -0.0252249 0.0114572 0.0182129 0.0594828 0.0101625 0.0711416 0.0453234 0.0590162 -0.0355367 -0.0210147 0.0085715 -0.0222706 0.0464643 -0.0342985 -0.0689108 -0.0637447 -0.0598599 0.0033897 0.0999523 -0.0186655 0.0633428 0.0236433 0.0268275 0.0903182 0.0142724 0.1067995 -0.1093053 -0.2157416 -0.0456638 -0.0032636 -0.0541712 0.0539064 0.0075025 -0.0017451 0.0078016 0.1091089 0.1041478 -0.0280679 -0.0438858 0.0265558 -0.0470505 -0.1104559 -0.0107053 -0.1302571 -0.0399273 unknown
polarizability: 192.7988167|-3.3578263|138.296784|5.2067873|-13.6599221|61.7865619 unknown
InChI: InChI=1S/C6H7Cl2N3S/c1-2-3-12-6-10-4(7)9-5(8)11-6/h2-3H2,1H3
charge 0 multiplicity 1
19 atoms
Cl 1.559014 3.041053 -0.521928
Cl 3.941313 -1.691176 0.377854
S  -1.413915 -1.454983 0.143811
N  1.272844 -1.392824 0.228338
N  0.194344 0.748154 -0.176332
N  2.610286 0.605761 -0.065422
C  -4.062274 -0.562196 -0.093016
C  -2.627768 -0.011135 -0.137901
C  -5.089034 0.572535 -0.313327
C  0.156796 -0.607678 0.054142
C  1.437901 1.268868 -0.221157
C  2.439648 -0.726682 0.156176
H  -4.192735 -1.338254 -0.871367
H  -4.248894 -1.048062 0.883718
H  -2.379656 0.437525 -1.112633
H  -2.436877 0.731405 0.652891
H  -4.943107 1.059804 -1.29483
H  -6.119259 0.176034 -0.282061
H  -5.001128 1.349151 0.468443
